program: Gaussian 09
title: 000296325
version: EM64L-G09RevD.01
frameworkgroup: C1[X(C9H10ClNO)]
method: RPBEPBE
basis: SDD
operation: Freq
keyword: #p
keyword: freq=noraman
keyword: PBEPBE/SDD
title: #p freq=noraman PBEPBE/SDD
converged: YES YES NO NO
title: Mulliken charges:
elementType: Cl O N C C C C C C C C C H H H H H H H H H H
charge: -0.079851 -0.249152 -0.441715 0.508625 0.494236 -0.643485 -0.371101 -0.382277 -0.208119 -0.806058 0.246103 -0.668814 0.229108 0.305865 0.232278 0.322835 0.226598 0.223272 0.233812 0.232584 0.297586 0.297672
chargesum: 0.00000
title: Mulliken charges with hydrogens summed into heavy atoms:
elementType: Cl O N C C C C C C C C C
charge: -0.079851 -0.249152 -0.118881 0.508625 0.494236 -0.414377 -0.065236 -0.150000 0.018479 -0.116390 0.246103 -0.073556
polarizability: 1.71988937e+02 5.17238640e+00 1.31664214e+02 3.10164151e-02 -2.17331066e-02 5.47543536e+01
1716.lowfreq: -13.6769 -5.9081 -2.2980 -0.0015 -0.0009 -0.0004 3.1821 35.5530 73.2249
frequency: -10.3972 35.3760 73.2181 85.1041 95.5413 192.6159 211.6813 257.6979 266.2382 360.7794 404.7502 440.4435 459.2990 517.0434 539.4430 584.8112 655.9230 674.2653 701.8286 740.5701 776.4092 806.0100 877.3427 891.6660 904.1872 924.0510 961.9156 984.8440 994.4411 1017.4920 1048.0724 1098.2150 1148.3036 1178.9416 1183.8915 1227.7193 1255.4517 1280.2648 1318.1882 1387.0194 1398.5166 1416.1367 1421.5389 1469.6639 1474.1035 1490.7420 1544.5832 1604.4948 1607.6537 1623.8701 2979.3846 3059.2453 3070.1233 3084.9611 3106.0106 3125.0685 3149.9192 3152.6585 3196.6672 3458.5194
redmass: 1.0259 4.7200 5.6547 2.9287 7.7128 7.4763 2.9812 3.9247 4.6854 6.8264 4.3495 2.7921 6.3762 5.1016 3.2967 3.3175 6.2754 6.5420 2.0599 1.1718 5.6916 1.3899 1.4401 4.8507 1.7164 1.3964 2.3224 5.1440 1.3251 2.0672 1.5586 1.5623 1.1108 1.7890 1.1265 2.5594 1.1898 2.5670 1.4533 7.0012 1.2778 1.5227 1.4708 1.0468 1.4524 1.8324 2.1398 4.1160 9.4997 5.8937 1.0371 1.0977 1.0564 1.0991 1.0915 1.0876 1.0958 1.1095 1.0951 1.0763
irintensity: 0.4036 0.7119 9.0725 7.7721 0.4572 9.5180 3.6353 1.3718 4.3753 0.9578 1.2817 6.9654 29.0056 0.3081 0.3818 0.6181 0.4569 87.5448 26.6916 51.9445 0.6744 60.6309 18.9519 3.6165 12.6349 11.1540 0.1279 0.0537 2.8270 3.8293 14.8548 14.7544 0.4784 0.0981 1.6583 14.1217 18.4043 2.1269 14.3988 23.2520 28.3985 55.9944 0.1687 13.2787 43.6492 95.1569 333.3310 3.6269 289.0896 43.9134 32.5806 19.7726 4.5846 16.5191 17.8139 8.4668 23.6768 0.8930 4.3063 66.9548
temp: 298.150 k
press: 1.00000 atm
elementType: 17 8 7 6 6 6 6 6 6 6 6 6 1 1 1 1 1 1 1 1 1 1
symmnumber: 1
zpe: 448569.2 jmol-1
zpe.correction: 0.170851 hartree
zpe.thermalcorrener: 0.181877 hartree
zpe.thermalcorrenthalpy: 0.182821 hartree
zpe.thermalcorrgfe: 0.132329 hartree
zpe.sumelectzpe: -938.136996 hartree
zpe.sumelectthermal: -938.125970 hartree
zpe.sumelectthermalent: -938.125026 hartree
zpe.sumelectthermalfe: -938.175518 hartree
dipole: -1.2182 -2.0156 0.0206
dipole: 2.3552
quadrupole: -68.0341 -80.6336 -80.3644
quadrupole: 1.7760 0.0196 -0.0446
quadrupole: 8.3099 -4.2896 -4.0204 1.7760 0.0196 -0.0446
hfenergy: -938.307847 hartree
pointgroup: C01 [X(C9H10Cl1N1O1)]
dipole: -0.6237233 -0.6690155 -0.1484018 debye
dipolederiv: -0.3090596 0.0402351 -0.0072242 0.3133142 -0.6749264 -0.0530001 0.0362894 -0.0779842 -0.1704153 -0.8174066 0.162028 -0.0161252 -0.5749781 -0.8782176 -0.1323292 -0.1315854 -0.0657927 -0.3722275 -1.7036671 0.0004205 -0.1262621 -0.1444183 -0.410644 -0.0325147 -0.149962 -0.0197892 -0.2990532 1.0484496 -0.1673072 0.0564624 -0.3805164 0.1710482 -0.025008 0.0250432 -0.0054651 0.1143671 0.3176765 0.1563941 0.0501639 0.2480439 0.1814372 0.0483386 0.0568186 0.0356766 0.0016737 -0.3729709 -0.055559 -0.0212024 -0.0933757 -0.0025713 0.0246088 -0.026223 0.0288373 -0.2200622 -0.24391 0.0395218 0.0008449 0.1756413 -0.1715952 0.017244 0.0213376 0.0051565 -0.1785954 -0.0833779 -0.0764814 -0.0020453 -0.1558764 -0.1814979 -0.0096012 -0.0131381 -0.002225 -0.2038757 0.0802338 -0.0208742 0.0157035 -0.0669339 0.1713132 0.0393306 0.0097552 0.0442554 -0.1250864 -0.1021145 -0.1299373 -0.0326029 -0.0705419 0.0243398 -0.0103738 -0.0136927 -0.0093049 0.0596295 1.68748 -0.1482378 0.1112489 1.0051967 0.8397884 0.1895431 0.2922924 0.0856947 0.2215267 -0.0470501 0.128525 0.0019132 -0.2448862 0.7999326 0.0812631 -0.0582838 0.1154542 0.1659913 0.0667539 0.0609796 0.000444 0.0617828 -0.0944624 -0.0336657 0.0007878 -0.0341543 0.1580579 0.1205202 -0.073382 -0.0167506 -0.0510994 0.0980502 -0.0176238 -0.0134615 -0.019919 0.1814364 -0.117828 0.0654532 -0.0143459 0.0505583 0.0795079 -0.0077298 -0.0172233 -0.0063071 0.1558338 0.2940615 -0.0949806 -0.014394 -0.1119768 0.2035238 -0.0228916 -0.0169286 -0.0214016 0.2839051 0.0641444 0.0382702 -0.0019492 0.0561848 -0.1098882 -0.0342631 0.0005292 -0.0359691 0.1451253 0.0502622 0.1239122 0.0186124 0.0097209 -0.1166394 -0.0403503 -0.0037946 -0.0316223 0.1013961 -0.0337691 -0.0540593 0.0957931 -0.0396463 0.062811 -0.0301712 0.1354002 0.0186374 -0.0306626 -0.0024932 -0.0155056 -0.1063872 0.0087361 0.0485736 0.0643262 -0.1396163 0.0102113 -0.0445112 0.0648306 0.0187877 -0.0454604 0.0200981 -0.0136898 -0.0405984 -0.084311 -0.0103601 0.0081788 0.0392343 0.001797 0.053563 -0.0150277 -0.0261937 0.0254664 0.0899668 -0.003629 0.0473677 unknown
polarizability: 171.5512527|-4.4507544|129.5892542|9.5614249|11.0007421|57.2669974 unknown
InChI: InChI=1S/C9H10ClNO/c1-7-3-2-4-8(5-7)11-9(12)6-10/h2-5,11H,6H2,1H3
charge 0 multiplicity 1
22 atoms
Cl 3.329917 -2.54367 0.046521
O  2.348083 1.382827 0.569565
N  1.048929 -0.548025 0.156227
C  -0.281844 -0.032793 0.117651
C  -2.676697 -0.554195 -0.170322
C  -1.327416 -0.966678 -0.115242
C  -0.580834 1.34118 0.298921
C  -2.969869 0.824156 0.011318
C  -1.931227 1.750337 0.24216
C  -3.791512 -1.557057 -0.413848
C  2.223464 0.135192 0.366767
C  3.523591 -0.677792 0.361312
H  -1.083811 -2.028689 -0.254738
H  0.225346 2.054569 0.477475
H  -4.011256 1.165188 -0.028891
H  1.152395 -1.559385 0.009246
H  -2.170198 2.810686 0.380907
H  -3.39809 -2.575903 -0.571304
H  -4.488425 -1.594283 0.444404
H  -4.387598 -1.283998 -1.304459
H  4.016876 -0.588877 1.340196
H  4.186077 -0.30649 -0.433961
