program: Gaussian 09
title: 000296323
version: EM64L-G09RevD.01
frameworkgroup: C1[X(C9H13NO)]
method: RPBEPBE
basis: SDD
operation: Freq
keyword: #p
keyword: freq=noraman
keyword: PBEPBE/SDD
title: #p freq=noraman PBEPBE/SDD
converged: YES YES NO NO
title: Mulliken charges:
elementType: O N C C C C C C C C C H H H H H H H H H H H H H
charge: -0.272981 -0.708248 0.321038 0.236503 -0.576285 -0.367417 0.529153 -0.456128 -0.793104 -0.236701 -0.687256 0.231171 0.223688 0.212595 0.231738 0.231624 0.208409 0.202895 0.202815 0.203809 0.230820 0.230739 0.302425 0.298698
chargesum: 0.00000
title: Mulliken charges with hydrogens summed into heavy atoms:
elementType: O N C C C C C C C C C
charge: -0.272981 -0.107124 0.321038 0.236503 -0.345114 -0.143730 0.529153 -0.243533 -0.121333 0.169009 -0.021889
polarizability: 1.45680398e+02 -6.38859165e+00 1.26778919e+02 -1.77493698e-02 5.08429231e-04 5.98144083e+01
1716.lowfreq: -10.0552 -4.1827 -3.0724 -0.0011 -0.0009 -0.0009 62.3742 99.2169 110.9105
frequency: 62.3551 99.2134 110.9081 129.1083 134.5685 225.8511 241.6606 262.5287 299.3788 309.9382 319.4015 349.1279 362.0331 452.4129 459.8772 503.6966 579.8927 623.7989 709.9427 720.0596 763.7918 791.5260 820.3606 839.7593 871.2018 923.2162 952.9693 997.1031 1036.5927 1044.7869 1046.0339 1114.2014 1124.6064 1136.2067 1168.0435 1218.4019 1258.7172 1280.8909 1321.2094 1363.5228 1388.0202 1398.0838 1398.7594 1435.4166 1456.4836 1459.9312 1476.7061 1479.9578 1490.1666 1518.8447 1592.3015 1632.2232 1641.6231 2947.5696 2974.5243 2995.4869 3003.5803 3050.1296 3080.6795 3092.5093 3104.3658 3114.1434 3137.9833 3143.3958 3572.8997 3713.9092
redmass: 2.9562 1.1958 1.4517 3.2302 3.1107 2.5616 1.5641 2.9528 1.1971 3.0342 3.7928 1.0688 3.4437 2.6266 5.3640 3.1055 6.0962 3.6901 2.1298 5.4355 4.3979 1.3407 1.5033 1.4390 3.1177 1.3438 2.1233 1.7723 2.7140 1.4617 1.4877 2.1749 2.1216 1.4354 1.7952 2.0702 1.1457 1.4941 2.8801 1.5297 3.0317 1.4394 1.2545 2.9815 1.0461 1.0404 1.0794 1.1321 1.1113 3.4261 6.4004 2.6082 1.5931 1.0551 1.0362 1.0361 1.1072 1.0972 1.0999 1.0988 1.1012 1.0869 1.0942 1.0924 1.0447 1.1040
irintensity: 1.0017 0.0114 2.9440 0.4999 6.5963 2.5961 0.0011 0.8047 243.0862 0.4425 26.8432 42.8832 6.8220 3.3110 0.6804 0.2447 5.5789 10.5480 3.3528 0.8142 3.6026 11.3028 62.6659 21.1789 7.0147 0.0270 11.8717 25.8951 44.7721 1.6359 4.6920 7.6972 181.8178 4.3335 64.1856 36.7474 0.1214 9.1590 79.7745 11.8706 12.5390 13.6651 15.7408 18.7343 8.9600 14.6261 29.0133 1.9012 21.0845 112.8836 62.0647 40.4578 309.8958 42.9668 48.6118 27.4955 40.0176 24.8203 25.5304 29.4159 36.0796 18.1764 39.9548 7.0087 56.4415 17.6986
temp: 298.150 k
press: 1.00000 atm
elementType: 8 7 6 6 6 6 6 6 6 6 6 1 1 1 1 1 1 1 1 1 1 1 1 1
symmnumber: 1
zpe: 528322.3 jmol-1
zpe.correction: 0.201227 hartree
zpe.thermalcorrener: 0.213178 hartree
zpe.thermalcorrenthalpy: 0.214122 hartree
zpe.thermalcorrgfe: 0.163755 hartree
zpe.sumelectzpe: -479.894619 hartree
zpe.sumelectthermal: -479.882669 hartree
zpe.sumelectthermalent: -479.881724 hartree
zpe.sumelectthermalfe: -479.932091 hartree
dipole: 0.3802 -2.9572 -0.0075
dipole: 2.9815
quadrupole: -54.7738 -55.9261 -71.2316
quadrupole: -0.8245 -0.0185 0.0157
quadrupole: 5.8701 4.7177 -10.5877 -0.8245 -0.0185 0.0157
hfenergy: -480.0958467 hartree
pointgroup: C01 [X(C9H13N1O1)]
dipole: -0.2115627 -1.1515992 0.0710637 debye
dipolederiv: -1.6302069 0.4910592 -0.0592092 0.5052007 -0.5272765 0.0262607 -0.0594601 0.0260762 -0.280012 -0.6808389 -0.6524383 0.0428441 -0.7589606 -1.0021624 -0.0017114 0.0483582 -0.0006038 -0.7579885 -0.3974343 0.1899148 -0.0179098 0.4027471 -0.08544 0.0066282 -0.0318008 0.0012907 -0.1125489 1.426985 -0.2843012 0.0453857 -0.2755155 0.3448897 -0.0207702 0.0438337 -0.0207985 0.1048682 -0.5365409 -0.2813731 0.0127045 -0.1587346 -0.1652363 -0.0115278 0.0051166 -0.014038 -0.2973129 0.412791 -0.0221481 0.0129727 0.1790395 0.1371101 -0.0138067 0.0004823 -0.0179912 -0.1403833 0.7068668 0.6190877 -0.0275188 0.8419532 1.090935 -0.0411494 -0.041729 -0.0461516 0.1547547 -0.0988353 0.0825957 -0.0017508 -0.4721117 -0.4656283 0.0021582 0.0333252 0.014036 -0.2772286 -0.0079624 -0.0992517 0.0038255 -0.0713634 0.0693931 -0.0000319 0.0025861 0.000197 0.0909786 0.6377305 -0.2392115 0.0199235 -0.5887347 0.594906 -0.0245546 0.0424544 -0.0173701 0.4018523 -0.1444998 0.0106491 -0.0047493 0.0433566 0.0586327 0.0009189 -0.0067065 0.0001209 0.0546465 0.0656497 0.0546661 -0.0056629 0.0747008 -0.1117971 0.019472 -0.0068483 0.0190044 0.1741436 0.0571998 0.0661023 -0.0060154 0.0859575 -0.1175709 0.0181822 -0.0072554 0.0176519 0.1429094 -0.1662185 0.0085227 -0.0075886 -0.0069156 0.0675878 0.0069646 -0.0064218 0.0072825 0.1809037 -0.0088363 -0.0826705 -0.1058843 -0.0474015 0.0436055 0.0175723 -0.1298925 -0.052721 -0.0548849 -0.0176487 -0.0714946 0.1168028 -0.0311118 0.0452919 -0.0303613 0.1363336 0.0385791 -0.0494381 0.0063466 0.1675192 -0.0116676 0.05172 -0.1231665 0.0143329 -0.0049045 0.0165449 0.1019059 -0.0207018 -0.0453078 0.0891056 0.0840484 -0.0667459 0.0807222 0.039753 0.1106639 -0.1051401 -0.0152112 -0.0508075 -0.0794033 0.0821912 -0.0915602 -0.0795598 -0.0468873 -0.115038 -0.0863828 -0.0120649 0.0912379 -0.0083643 0.1393547 -0.1139438 0.0168347 -0.0113811 0.0158101 0.1112857 0.0635299 -0.0197084 0.0375157 -0.0853861 0.0606513 0.0928302 0.0770887 0.0839463 -0.071862 0.0673911 -0.0199618 -0.0297585 -0.0894931 0.0367745 -0.1104054 -0.0610788 -0.0986073 -0.0524648 0.1601677 0.0499134 -0.0077624 0.0423265 0.1534034 0.0158572 -0.0067884 0.0162449 0.3859126 0.1323419 0.0374065 -0.0078348 0.0531326 0.1673469 0.0151442 -0.0081772 0.0158703 0.381486 unknown
polarizability: 146.2710155|5.4444657|125.9028672|1.4590573|-4.0490616|60.0998425 unknown
InChI: InChI=1S/C9H13NO/c1-3-11-9-6-8(10)5-4-7(9)2/h4-6H,3,10H2,1-2H3
charge 0 multiplicity 1
24 atoms
O  1.779706 0.085985 0.133564
N  -2.730964 -1.906154 0.165561
C  -0.143294 1.498181 0.005574
C  0.372601 0.172013 0.099363
C  -0.474253 -0.957837 0.152426
C  -1.548275 1.631938 -0.03212
C  -1.888024 -0.789128 0.112734
C  -2.421829 0.5238 0.019289
C  0.791927 2.689204 -0.049708
C  2.39173 -1.249395 0.232035
C  3.904793 -1.04382 0.252034
H  -0.061407 -1.969516 0.223936
H  -1.973507 2.640677 -0.104112
H  -3.507397 0.67422 -0.012148
H  1.440659 2.735972 0.844946
H  1.470339 2.630927 -0.921471
H  0.221167 3.631993 -0.115644
H  2.042406 -1.75092 1.158834
H  2.082638 -1.865283 -0.638479
H  4.421434 -2.018511 0.322731
H  4.23942 -0.535194 -0.668242
H  4.201652 -0.425505 1.116389
H  -3.739309 -1.793261 0.137976
H  -2.352612 -2.845384 0.235232
