program: Gaussian 09
title: 000296337
version: EM64L-G09RevD.01
frameworkgroup: C1[X(C12H18N2O)]
method: RPBEPBE
basis: SDD
operation: Freq
keyword: #p
keyword: freq=noraman
keyword: PBEPBE/SDD
title: #p freq=noraman PBEPBE/SDD
converged: YES YES NO NO
title: Mulliken charges:
elementType: O N N C C C C C C C C C C C C H H H H H H H H H H H H H H H H H H
charge: -0.266875 -0.126270 -0.003905 -0.335916 -0.378939 -0.350664 -0.334603 0.107119 -0.683851 -0.676203 0.315179 -0.321076 -0.333980 -0.328384 -0.325803 0.251423 0.196954 0.244732 0.210801 0.192646 0.239387 0.202736 0.213794 0.220397 0.204699 0.222961 0.216192 0.208467 0.226425 0.257228 0.250147 0.243238 0.241944
chargesum: 0.00000
title: Mulliken charges with hydrogens summed into heavy atoms:
elementType: O N N C C C C C C C C C C C C
charge: -0.266875 -0.126270 -0.003905 0.112461 0.076595 0.081368 0.081927 0.107119 -0.035793 -0.025119 0.315179 -0.063848 -0.083833 -0.085146 -0.083859
polarizability: 1.81827454e+02 -6.29740465e-01 1.20474422e+02 6.91335242e-01 6.83490465e+00 1.29907175e+02
1716.lowfreq: -18.6636 -12.9495 -7.1516 -0.0002 0.0007 0.0007 13.8413 26.4646 42.7140
frequency: 5.4540 25.8839 42.6892 56.0828 61.9805 71.0817 89.6775 112.8196 193.6807 224.0451 228.6874 241.6977 260.5331 270.4979 309.8479 346.3422 361.3277 372.1137 419.6927 528.6513 577.5999 636.7075 658.0483 705.3214 722.8835 740.6230 745.5593 757.3179 834.6792 855.9391 865.5829 886.9576 888.7592 892.1473 944.7018 958.0737 969.3118 976.1332 1045.5981 1051.0132 1062.1907 1082.5017 1086.8601 1097.3091 1104.9645 1111.9988 1191.6835 1202.6888 1219.2066 1246.5700 1263.4174 1286.7180 1294.4453 1295.2059 1302.1832 1308.4552 1325.7698 1350.7240 1361.0721 1391.1501 1393.2822 1398.5277 1409.0950 1446.5580 1462.8265 1470.5338 1473.1565 1475.6857 1479.5083 1480.5211 1484.7778 1487.3630 1539.6426 1559.1419 1580.9930 2976.0097 2977.1642 2982.9869 2984.2242 2993.8176 3001.0116 3033.4845 3039.1507 3064.1997 3070.2320 3078.7272 3080.8962 3081.7365 3086.4369 3127.5760 3135.2895 3151.6493 3167.3830
redmass: 2.8432 3.3285 4.0234 3.6181 2.0305 2.0502 3.2149 4.3731 4.6179 1.1241 1.1380 2.9771 3.7738 3.0153 3.4721 3.0506 3.0481 3.5976 3.5649 5.2387 3.7234 5.0987 6.7732 5.2395 3.7173 1.1249 1.2369 2.9323 1.6148 1.5706 1.2535 1.5612 1.5244 1.3979 3.0466 5.3852 1.4540 1.4973 2.9805 2.9603 2.3917 1.6362 1.7590 2.0142 2.1210 2.2301 2.5477 2.2910 1.2705 1.4964 1.4420 1.2664 2.9643 1.3746 1.4786 1.2727 1.5212 1.3440 1.3662 1.2099 1.2073 1.8705 2.4279 1.1278 1.7640 1.2196 1.0711 1.0856 1.0449 1.0454 1.0764 1.0843 7.2233 6.6417 5.6589 1.0360 1.0361 1.0613 1.0621 1.0656 1.0611 1.0991 1.0967 1.1022 1.0993 1.1012 1.1009 1.0994 1.0995 1.0875 1.0894 1.0972 1.0972
irintensity: 0.3417 0.1525 0.1064 1.2787 0.3087 0.0880 0.4116 3.7153 3.2071 0.1829 0.0779 0.9013 1.6495 0.1206 2.3101 7.8127 4.0627 5.5113 10.5358 4.3707 12.1065 18.8029 2.8926 13.8749 4.1432 6.7183 13.6289 6.3191 52.5768 2.6300 1.9212 2.4677 14.5332 8.7015 0.4611 2.2456 1.2661 0.4028 0.5392 0.8786 14.2770 9.8159 27.3454 34.2765 0.1431 3.4749 3.9776 11.1012 1.2539 36.5641 22.3035 12.6947 0.5342 24.9991 2.3139 20.5375 1.6882 4.1740 4.2235 15.3295 12.6242 14.6133 130.5442 21.1438 3.3049 7.4486 6.6177 3.0389 13.9495 9.2214 15.9052 17.6644 87.3279 173.1261 14.1549 41.2596 29.4896 7.5804 5.3016 58.2082 39.9668 7.8002 1.4959 3.5016 27.7159 58.4370 31.9354 45.1155 60.0782 9.9217 18.4469 20.6055 6.6691
temp: 298.150 k
press: 1.00000 atm
elementType: 8 7 7 6 6 6 6 6 6 6 6 6 6 6 6 1 1 1 1 1 1 1 1 1 1 1 1 1 1 1 1 1 1
symmnumber: 1
zpe: 733875.8 jmol-1
zpe.correction: 0.279519 hartree
zpe.thermalcorrener: 0.295848 hartree
zpe.thermalcorrenthalpy: 0.296792 hartree
zpe.thermalcorrgfe: 0.231510 hartree
zpe.sumelectzpe: -651.653783 hartree
zpe.sumelectthermal: -651.637454 hartree
zpe.sumelectthermalent: -651.636510 hartree
zpe.sumelectthermalfe: -651.701791 hartree
dipole: 3.1686 3.6128 1.2399
dipole: 4.9629
quadrupole: -99.3298 -96.3600 -86.5500
quadrupole: 0.9131 4.9184 -3.8277
quadrupole: -5.2498 -2.2801 7.5299 0.9131 4.9184 -3.8277
hfenergy: -651.9333015 hartree
pointgroup: C01 [X(C12H18N2O1)]
dipole: -1.1674313 -1.4147836 0.6692771 debye
polarizability: 181.7166294|2.565944|119.0514956|-0.772497|-5.5269194|131.4409248 unknown
InChI: InChI=1S/C12H18N2O/c1-3-9-14(10-4-2)12(15)11-5-7-13-8-6-11/h5-8H,3-4,9-10H2,1-2H3
charge 0 multiplicity 1
33 atoms
O  -0.66889 1.641264 -1.412271
N  -1.206746 -0.186233 -0.069367
N  3.945878 0.645306 0.410628
C  -2.643859 0.014477 -0.390466
C  -0.837362 -1.439405 0.631344
C  -3.331838 0.992518 0.589588
C  -0.770086 -2.665848 -0.312264
C  -0.302495 0.715652 -0.613778
C  -4.830811 1.165278 0.265866
C  -0.463265 -3.964636 0.463296
C  1.157342 0.61358 -0.226961
C  2.140933 0.550162 -1.244396
C  1.600321 0.718959 1.116004
C  3.505734 0.55576 -0.881762
C  2.988356 0.736875 1.381293
H  -2.718404 0.414541 -1.41767
H  -3.144839 -0.971247 -0.362953
H  0.139036 -1.315306 1.126288
H  -1.585212 -1.621998 1.427956
H  -3.207991 0.623181 1.627206
H  -2.816196 1.968519 0.526933
H  -1.728656 -2.770158 -0.856974
H  0.011145 -2.484702 -1.075764
H  -4.972167 1.556129 -0.758938
H  -5.373513 0.203533 0.339537
H  -5.308194 1.875225 0.964683
H  0.503479 -3.893693 0.996058
H  -1.247656 -4.178693 1.213731
H  -0.40682 -4.830485 -0.21999
H  1.842062 0.516066 -2.296408
H  0.884854 0.815058 1.939966
H  4.287944 0.494345 -1.646613
H  3.359516 0.829879 2.408299
