program: Gaussian 09
title: 000027408
version: EM64L-G09RevD.01
frameworkgroup: C1[X(C19H21ClN3OS)]
method: RPBEPBE
basis: SDD
operation: Freq
keyword: #p
keyword: freq=noraman
keyword: PBEPBE/SDD
title: #p freq=noraman PBEPBE/SDD
converged: YES YES NO NO
title: Mulliken charges:
elementType: Cl S O N N N C C C C C C C C C C C C C C C C C C C H H H H H H H H H H H H H H H H H H H H H
charge: -0.012742 0.319064 -0.188953 -0.110896 -0.296266 -0.040578 -0.297224 -0.556611 -0.552543 -0.547155 -0.723871 -0.253172 0.146842 0.125719 0.141428 0.385491 -0.307357 -0.314749 -0.314082 -0.308914 -0.231909 -0.101070 -0.208647 -0.204895 -0.221143 0.312141 0.274754 0.285758 0.267554 0.260014 0.264831 0.273854 0.269139 0.273316 0.265790 0.268315 0.292078 0.312744 0.287953 0.248206 0.248834 0.254533 0.277220 0.243964 0.245494 0.247741
chargesum: 1.00000
title: Mulliken charges with hydrogens summed into heavy atoms:
elementType: Cl S O N N N C C C C C C C C C C C C C C C C C C C
charge: -0.012742 0.319064 -0.188953 -0.110896 -0.296266 -0.040578 0.289671 0.256715 0.255281 0.260266 -0.119049 -0.253172 0.146842 0.125719 0.141428 0.385491 -0.019404 -0.066543 -0.065248 -0.054381 0.045311 -0.101070 0.035317 0.040599 0.026598
polarizability: 3.65407584e+02 -2.51870074e+01 2.76554003e+02 -6.22029220e+00 -1.09399977e+01 1.64592764e+02
1716.lowfreq: -5.8101 -5.5725 0.0014 0.0025 0.0027 1.2762 15.6343 24.6683 28.6129
frequency: 15.4613 24.5883 28.5709 34.5133 36.1522 56.4539 79.9533 92.1158 96.8306 126.5921 132.0342 166.9967 188.8174 190.7329 216.6384 233.0611 246.9634 250.0248 260.3393 278.2037 292.3130 302.8055 326.6112 339.6979 348.6771 349.3707 404.9667 422.9799 423.5527 433.6216 440.1700 456.9395 485.0297 490.9715 543.0823 574.5649 579.8942 587.8170 611.3599 639.3620 653.7730 676.6078 684.4776 694.8017 695.8216 728.2538 754.1071 758.2181 776.3104 811.1169 844.8016 847.8035 850.3768 870.1557 891.0756 911.8804 923.7491 930.7748 943.2749 978.9233 989.3657 989.4060 1006.7992 1009.7428 1016.4344 1035.1268 1047.0510 1057.8063 1065.7925 1080.6110 1106.5883 1113.5386 1116.4757 1174.7168 1178.8722 1179.7383 1183.2096 1210.3564 1217.7352 1224.3401 1244.8331 1254.6626 1258.8209 1272.0224 1293.8541 1311.4875 1324.7012 1361.3879 1383.7410 1384.3059 1410.8120 1419.8540 1424.2137 1427.3996 1438.6753 1439.8278 1451.1356 1452.2692 1463.0774 1465.7681 1469.3138 1475.3565 1482.8073 1486.7581 1499.6499 1526.4319 1555.2569 1597.8700 1602.5834 1604.1488 1641.3626 3023.7333 3026.0059 3030.0817 3033.0405 3047.3279 3105.9168 3133.8095 3139.2326 3142.0916 3142.7908 3144.6153 3147.3615 3148.9339 3150.6882 3156.7402 3157.5269 3162.8492 3166.4335 3172.0921 3178.8909 3185.4100
redmass: 4.3359 5.4002 6.3548 3.2047 3.8779 5.6694 3.4917 7.0162 4.9176 2.9471 6.0127 4.0516 3.7813 1.7131 2.6586 3.8013 5.1792 1.1842 1.1084 4.1028 6.3387 8.5104 8.0291 3.6062 2.9627 2.8365 2.8040 7.3979 4.9658 2.3599 2.6577 4.0951 3.2682 3.3635 10.2535 5.9030 6.7683 9.5203 6.3886 9.8757 6.2143 4.7449 5.5466 6.9132 1.9736 2.2484 1.6657 1.9443 3.6277 4.7607 1.2481 1.5051 3.4054 1.6239 6.0693 5.5439 2.7871 1.6195 2.6309 1.3899 1.5625 3.7359 1.3436 2.5420 1.9144 2.5817 1.2016 2.6384 1.8668 1.5334 1.2810 1.5485 1.9260 2.5450 1.0654 1.2558 1.3863 2.4366 1.7432 3.3527 1.8307 1.4117 1.5687 1.3114 5.7272 1.3285 1.2015 1.2691 10.0824 10.0916 2.4725 1.3374 1.1719 1.1710 1.0943 2.1750 2.0507 1.2066 1.0967 1.0508 1.0805 2.3184 1.0580 1.0554 1.0557 9.4032 8.9562 6.5392 6.8832 6.5697 12.3584 1.0322 1.0337 1.0477 1.0424 1.0566 1.1075 1.1085 1.1058 1.0859 1.1055 1.1052 1.0889 1.1058 1.1051 1.0932 1.1049 1.0901 1.0975 1.0925 1.1020 1.0972
irintensity: 0.2486 1.1988 1.4780 2.0334 3.7421 0.9997 2.2339 2.6747 0.9019 3.2561 1.2437 2.8753 4.4615 0.7407 4.1833 1.1661 0.1313 0.2291 0.1476 1.1195 0.3519 2.0892 4.4776 4.1684 3.7166 2.0447 0.0118 16.1634 3.5937 1.4175 0.6136 2.8544 3.5686 14.8982 7.8100 2.3539 8.6213 11.8346 0.8382 0.1711 4.8752 12.5655 2.5966 22.3708 41.5916 9.8358 11.0639 51.4410 9.7482 8.5349 0.0923 32.9608 74.1334 13.5807 61.4780 13.9396 8.5453 6.6902 16.0251 0.0666 2.2560 7.7675 0.2965 19.3150 13.0141 23.1030 0.3770 16.6741 34.3111 10.8141 2.9736 7.9564 18.3083 124.1470 0.8270 7.1854 36.0061 20.3073 9.9932 55.5001 0.0417 4.7210 0.8858 3.6227 101.2414 1.0483 5.1285 6.5364 4.0626 12.5385 46.7165 4.4536 16.4513 21.8280 3.2561 8.6193 141.2364 36.9013 5.6799 12.5748 10.6853 40.8959 59.0297 35.1472 98.2659 375.7993 54.3547 4.4447 119.6143 85.2062 281.9003 2.4633 1.1371 7.8985 11.0463 12.8150 0.3197 0.0809 0.8696 1.0836 2.1920 2.2402 0.4152 6.0501 5.5863 11.6919 4.9829 1.4940 12.2019 5.1992 10.4583 0.3460
temp: 298.150 k
press: 1.00000 atm
elementType: 17 16 8 7 7 7 6 6 6 6 6 6 6 6 6 6 6 6 6 6 6 6 6 6 6 1 1 1 1 1 1 1 1 1 1 1 1 1 1 1 1 1 1 1 1 1
symmnumber: 1
zpe: 957364.2 jmol-1
zpe.correction: 0.364641 hartree
zpe.thermalcorrener: 0.388868 hartree
zpe.thermalcorrenthalpy: 0.389812 hartree
zpe.thermalcorrgfe: 0.307971 hartree
zpe.sumelectzpe: -1832.181269 hartree
zpe.sumelectthermal: -1832.157042 hartree
zpe.sumelectthermalent: -1832.156098 hartree
zpe.sumelectthermalfe: -1832.237939 hartree
dipole: 7.5469 15.9876 1.0756
dipole: 17.7120
quadrupole: -108.4313 -88.9962 -147.2955
quadrupole: 31.5710 5.2271 5.0981
quadrupole: 6.4764 25.9115 -32.3879 31.5710 5.2271 5.0981
hfenergy: -1832.5459103 hartree
pointgroup: C01 [X(C19H21Cl1N3O1S1)]
dipole: -3.004552 6.284468 0.1935291 debye
polarizability: 334.3388986|49.1554113|305.0619053|22.4863535|-5.0874492|167.1535475 unknown
InChI: InChI=1S/C19H21ClN3OS/c1-23(2,3)11-12-25-19-21-17-13-14(20)9-10-16(17)18(24)22(19)15-7-5-4-6-8-15/h4-10,13H,11-12H2,1-3H3
charge 1 multiplicity 1
46 atoms
Cl 5.433203 1.726611 0.500061
S  -2.31536 0.367593 -0.69195
O  0.817586 -3.395757 0.682443
N  -1.366855 4.366733 0.359966
N  -0.521263 -1.568231 0.041241
N  0.381737 0.654683 -0.186736
C  -1.841576 2.880605 0.38375
C  0.049983 4.464303 -0.20578
C  -2.316961 5.226858 -0.467335
C  -1.359583 4.87083 1.803386
C  -1.887531 2.188395 -0.982312
C  -0.614474 -0.208311 -0.230348
C  1.878234 -1.217782 0.446537
C  0.752626 -2.170987 0.42046
C  1.664624 0.163071 0.137124
C  -1.692635 -2.440594 -0.04062
C  3.179436 -1.677603 0.775533
C  2.762998 1.061498 0.154646
C  -2.423234 -2.726148 1.133789
C  -2.047025 -3.00844 -1.284309
C  4.26679 -0.78956 0.799074
C  4.035196 0.5728 0.483401
C  -3.54158 -3.583814 1.055065
C  -3.168542 -3.863539 -1.353022
C  -3.915836 -4.149367 -0.186585
H  -1.121287 2.350785 1.029069
H  -2.83631 2.88354 0.862317
H  0.684203 3.720948 0.299444
H  0.030289 4.255834 -1.284537
H  0.430514 5.482398 -0.031586
H  -1.981395 6.274603 -0.424205
H  -2.308498 4.881778 -1.511021
H  -3.333072 5.142285 -0.052353
H  -0.647521 4.2700 2.38919
H  -1.054529 5.928499 1.816527
H  -2.370161 4.768984 2.227076
H  -2.685152 2.555462 -1.647107
H  -0.9097 2.191123 -1.48643
H  3.314189 -2.73868 1.007577
H  2.610436 2.111552 -0.107485
H  -2.109822 -2.299328 2.09212
H  -1.448731 -2.794515 -2.175939
H  5.272949 -1.134587 1.050145
H  -4.111498 -3.81828 1.959793
H  -3.450823 -4.3128 -2.310421
H  -4.779736 -4.819749 -0.242752
