program: Gaussian 09
title: 000296293
version: EM64L-G09RevD.01
frameworkgroup: C1[X(C11H22N2)]
method: RPBEPBE
basis: SDD
operation: Freq
keyword: #pfreq=noraman
keyword: PBEPBE/SDD
title: #p freq=noraman PBEPBE/SDD
converged: YES YES NO NO
title: Mulliken charges:
elementType: N N C C C C C C C C C C C H H H H H H H H H H H H H H H H H H H H H H
charge: -0.082583 -0.276591 0.044812 -0.465656 -0.359729 -0.416676 -0.406922 -0.425937 -0.419365 -0.454467 -0.442951 -0.438371 -0.436125 0.228968 0.200947 0.190134 0.189536 0.207728 0.200294 0.197450 0.183789 0.200923 0.210057 0.225374 0.212978 0.223797 0.215128 0.227286 0.223295 0.218293 0.174980 0.208077 0.208354 0.173937 0.259237
chargesum: 0.00000
title: Mulliken charges with hydrogens summed into heavy atoms:
elementType: N N C C C C C C C C C C C
charge: -0.082583 -0.017354 0.273780 -0.074575 0.037535 -0.018933 -0.022210 0.009493 0.017410 -0.012053 -0.001363 -0.055314 -0.053834
polarizability: 1.50789431e+02 -9.56263430e-01 1.22267768e+02 -4.60312276e-01 5.84740544e-01 1.09665784e+02
1716.lowfreq: -8.5013 -0.0006 -0.0005 0.0004 6.3183 13.0750 25.9405 37.8831 45.0950
frequency: 24.6206 37.5519 44.9294 60.0655 115.5717 140.3034 202.3186 239.9879 275.6598 327.2921 339.7259 383.1684 399.2702 433.7622 449.3718 514.8247 536.0355 624.7692 638.5147 686.6479 717.8053 772.8543 808.2522 809.3345 841.9354 859.9575 875.1663 896.4396 902.7955 907.9716 925.0288 943.3146 977.7714 998.6256 1009.1608 1030.1988 1054.7875 1063.2732 1068.2623 1078.2873 1100.1765 1126.2548 1137.1965 1145.9939 1169.9527 1172.1675 1182.8317 1204.9907 1212.1536 1216.7098 1245.8157 1255.9595 1266.8060 1273.0815 1280.9624 1292.2664 1297.1023 1309.2409 1316.1534 1317.7723 1320.9715 1339.2373 1353.5109 1358.8015 1366.8072 1385.4792 1441.0941 1448.0474 1452.4003 1460.4300 1463.5697 1466.5282 1469.5189 1470.5440 1475.4257 1477.8308 1487.8473 2835.0518 2842.3377 2862.4484 2956.2710 2965.7011 2968.3676 2976.8853 2979.4562 2991.3145 3001.8319 3003.8138 3017.1768 3023.1938 3027.2328 3027.7937 3033.0816 3042.4180 3053.3879 3068.9407 3075.0871 3088.6466 3446.2963
redmass: 3.0573 2.6601 2.7220 2.4646 2.8205 3.2269 2.7128 1.7696 2.3817 1.8537 2.3821 1.8801 2.6297 2.0948 2.8344 2.4014 1.7457 2.1820 3.0843 1.7543 1.7816 2.2063 1.5120 1.6924 1.7323 2.4632 3.4805 2.1899 2.0087 2.2882 2.1579 1.6881 1.4466 2.0141 2.1070 2.4428 2.5111 1.7537 2.2554 1.7377 2.0668 2.3440 2.6287 1.3226 1.7197 1.5125 1.2853 1.2623 1.3702 1.2264 1.3251 1.2860 1.2518 1.2648 1.3208 1.2319 1.2411 1.2626 1.2263 1.4267 1.3861 1.4025 1.6068 1.4263 1.3666 1.4225 1.1790 1.2059 1.1009 1.0860 1.0829 1.0756 1.0817 1.0823 1.1032 1.0896 1.0949 1.0718 1.0697 1.0707 1.0602 1.0705 1.0637 1.0671 1.0661 1.0661 1.0605 1.0957 1.0640 1.0880 1.0928 1.0902 1.0984 1.1018 1.1009 1.0987 1.1013 1.1050 1.0751
irintensity: 0.5484 0.0668 0.1642 0.5191 0.8666 0.2281 0.3977 0.5213 0.2446 2.1094 2.7885 8.2776 8.3146 5.3650 1.2485 19.9690 46.5818 5.4288 13.3836 83.4281 13.5376 3.0395 1.3752 2.9157 1.5349 1.5015 19.5802 2.6424 0.8835 4.3757 12.2460 3.4274 2.6609 21.0450 10.7518 4.2654 5.8228 4.0643 17.9258 1.0180 19.0597 5.0385 2.0950 12.8780 4.2851 5.2298 7.3472 6.1398 1.9702 3.0734 14.3893 10.8343 6.1484 0.9621 4.3748 0.1696 1.8621 7.2446 3.4045 19.3258 14.1893 2.8026 0.8996 4.2551 6.4970 3.0778 6.8448 0.2273 4.3073 13.9470 5.0271 0.6162 17.8272 9.7614 8.6913 0.1771 11.3886 57.4127 164.6550 88.2221 28.4825 13.1007 34.5749 45.0560 48.7974 37.4703 35.3469 21.8585 60.1726 84.2801 36.9618 9.6126 85.6426 83.3449 20.9311 7.7615 24.3986 98.6629 3.9592
temp: 298.150 k
press: 1.00000 atm
elementType: 7 7 6 6 6 6 6 6 6 6 6 6 6 1 1 1 1 1 1 1 1 1 1 1 1 1 1 1 1 1 1 1 1 1 1
symmnumber: 1
zpe: 837768.6 jmol-1
zpe.correction: 0.319089 hartree
zpe.thermalcorrener: 0.332440 hartree
zpe.thermalcorrenthalpy: 0.333384 hartree
zpe.thermalcorrgfe: 0.277313 hartree
zpe.sumelectzpe: -540.771180 hartree
zpe.sumelectthermal: -540.757830 hartree
zpe.sumelectthermalent: -540.756886 hartree
zpe.sumelectthermalfe: -540.812957 hartree
dipole: -1.2531 0.0170 -0.4501
dipole: 1.3316
quadrupole: -79.4314 -79.7079 -82.0051
quadrupole: 0.6738 -4.3650 0.1829
quadrupole: 0.9501 0.6735 -1.6236 0.6738 -4.3650 0.1829
hfenergy: -541.0902697 hartree
pointgroup: C01 [X(C11H22N2)]
dipole: -0.485874 0.0083971 0.1957479 debye
polarizability: 150.7964633|0.189705|122.2453549|-1.1013972|0.4604882|109.6811647 unknown
InChI: InChI=1S/C11H22N2/c1-2-9-13(8-1)10-5-11-3-6-12-7-4-11/h11-12H,1-10H2
charge 0 multiplicity 1
35 atoms
N  -1.722064 -0.140583 0.408816
N  4.063005 -0.519642 0.117799
C  1.265279 0.293281 -0.211606
C  0.089646 0.781715 -1.09154
C  -1.198292 -0.066023 -0.986231
C  1.777251 -1.111074 -0.623335
C  2.439868 1.30436 -0.25302
C  -2.7468 -1.205155 0.607999
C  -2.433392 1.095663 0.851002
C  -4.113135 -0.592289 0.151793
C  -3.94287 0.937733 0.428187
C  2.990927 -1.534624 0.231249
C  3.634906 0.815595 0.592379
H  0.89113 0.224623 0.831775
H  0.404951 0.797297 -2.156473
H  -0.141873 1.833951 -0.823707
H  -1.952482 0.340638 -1.706112
H  -0.981951 -1.101735 -1.308731
H  2.081787 -1.094987 -1.689482
H  0.97478 -1.864535 -0.50706
H  2.1036 2.293725 0.11771
H  2.779298 1.434387 -1.30055
H  -2.791428 -1.450816 1.687527
H  -2.468703 -2.12292 0.062165
H  -1.958976 1.993877 0.421702
H  -2.360131 1.171895 1.952669
H  -4.966781 -1.028637 0.699695
H  -4.276319 -0.778643 -0.92519
H  -4.175074 1.533577 -0.471979
H  -4.613653 1.28464 1.234195
H  2.644601 -1.671819 1.289045
H  3.385127 -2.506811 -0.11979
H  4.485547 1.51611 0.495571
H  3.324832 0.805479 1.670326
H  4.940892 -0.827552 0.555704
