program: Gaussian 09
title: 000296284
version: EM64L-G09RevD.01
frameworkgroup: C1[X(C7H6N2O2S2)]
method: RPBEPBE
basis: SDD
operation: Freq
keyword: #p
keyword: freq=noraman
keyword: PBEPBE/SDD
title: #p freq=noraman PBEPBE/SDD
converged: YES YES NO NO
title: Mulliken charges:
elementType: S S O O N N C C C C C C C H H H H H H
charge: 0.952587 0.356810 -0.532557 -0.535153 -0.717968 0.027903 -0.031287 -0.238831 -0.219743 -0.107856 -0.211935 -0.184747 -0.349633 0.292144 0.292475 0.269328 0.259644 0.338680 0.340139
chargesum: 0.00000
title: Mulliken charges with hydrogens summed into heavy atoms:
elementType: S S O O N N C C C C C C C
charge: 0.952587 0.356810 -0.532557 -0.535153 -0.039149 0.027903 -0.031287 0.053313 0.072732 0.161472 0.047709 -0.184747 -0.349633
polarizability: 2.01717763e+02 1.23235835e+01 1.36425139e+02 -2.31416142e+00 -3.71212642e-01 7.18291017e+01
1716.lowfreq: -5.4506 -0.0013 -0.0010 0.0018 4.4142 5.3479 20.6672 37.5031 69.6069
frequency: 20.1725 37.4154 69.5830 85.3110 117.4995 134.3648 160.1640 209.4685 252.2524 274.1005 277.7287 348.3385 366.3135 367.7338 370.7448 406.8747 444.6062 465.8851 495.6785 517.3733 610.5374 646.6245 688.8127 716.4325 795.2781 805.5927 837.9176 845.4748 909.1566 967.7286 981.9140 983.0705 1051.8778 1060.4499 1071.6398 1120.8890 1189.0475 1293.3925 1381.1135 1387.2772 1455.6011 1535.5021 1573.2299 1595.0694 2110.0411 3149.4326 3151.8066 3167.9336 3170.6376 3368.0105 3535.2152
redmass: 8.8782 4.0061 8.0981 11.8991 1.5270 9.9997 6.2685 14.0366 5.8393 9.1126 2.5725 7.4439 6.1882 9.3725 11.5316 2.9203 10.0193 3.9079 8.2444 3.2954 7.3347 16.6794 6.4067 3.8589 2.2567 3.9187 1.3255 1.3721 4.0015 1.3541 1.3728 6.9049 6.9351 1.9045 1.4879 1.3465 1.1347 1.2412 7.2364 3.2985 2.0339 1.0848 5.9580 7.9171 12.7462 1.0892 1.0888 1.0965 1.0977 1.0415 1.1003
irintensity: 1.6833 1.8696 1.7148 4.1693 37.4037 1.8097 1.5626 5.7739 3.9975 3.3029 3.5092 1.7792 4.8505 50.5758 0.6288 0.0619 25.8575 84.8232 22.6726 128.9747 0.2069 3.4136 15.4200 1.9138 44.0796 235.2712 22.8341 36.8322 57.3162 0.2079 0.1553 23.6173 66.4854 1.1592 27.2171 1.7274 5.4822 0.5764 3.4384 24.2513 46.0172 23.7964 38.7361 0.6063 25.7353 1.3375 1.3555 0.7605 5.8193 32.9913 27.7886
temp: 298.150 k
press: 1.00000 atm
elementType: 16 16 8 8 7 7 6 6 6 6 6 6 6 1 1 1 1 1 1
symmnumber: 1
zpe: 314488.2 jmol-1
zpe.correction: 0.119782 hartree
zpe.thermalcorrener: 0.133661 hartree
zpe.thermalcorrenthalpy: 0.134605 hartree
zpe.thermalcorrgfe: 0.077107 hartree
zpe.sumelectzpe: -1325.259031 hartree
zpe.sumelectthermal: -1325.245152 hartree
zpe.sumelectthermalent: -1325.244208 hartree
zpe.sumelectthermalfe: -1325.301706 hartree
dipole: -0.2142 -2.3814 2.9205
dipole: 3.7744
quadrupole: -106.2891 -90.1173 -94.1925
quadrupole: -10.9065 -14.8956 1.2194
quadrupole: -9.4228 6.7490 2.6738 -10.9065 -14.8956 1.2194
hfenergy: -1325.378813 hartree
pointgroup: C01 [X(C7H6N2O2S2)]
dipole: -0.0019399 0.9053306 -1.177092 debye
dipolederiv: 2.2325611 0.3059541 0.0177819 0.3126532 1.6278196 -0.0584108 0.1024817 -0.0416313 1.1980515 -0.4106243 0.0034083 0.1769583 0.0132215 0.1466349 0.0055329 0.2418162 0.0102077 0.1159184 -0.7522423 -0.0702745 -0.0469562 -0.0725166 -0.5229738 -0.0296139 -0.1260812 0.1427539 -0.6453364 -0.8034873 -0.0011648 0.0492158 -0.0317745 -0.5797389 0.0014837 0.09074 -0.1693641 -0.5475038 -0.7300702 -0.0751525 -0.0291888 -0.179604 -0.8934915 0.0996874 -0.0204895 0.0992308 -0.3891507 -0.2976191 0.0025551 0.0411112 0.0369844 -0.181102 -0.0093317 0.1890279 0.0000564 -0.2311989 -0.1528776 0.0516024 0.0243454 0.1379846 -0.1489419 0.020166 -0.0572717 0.009262 -0.1328765 -0.0712457 0.0035565 0.1056255 -0.0642349 -0.0806421 0.0009726 -0.2693894 -0.0028955 0.0050912 -0.0720632 -0.0440026 -0.1350735 0.0383709 -0.0747246 0.0228633 0.2658109 0.0250677 -0.0234701 -0.4268868 -0.0528908 -0.1491776 -0.0581433 -0.086879 -0.0050674 -0.0874411 -0.0014166 -0.0531512 -0.4609814 0.0095551 0.1627976 -0.0356033 -0.0980391 0.0435878 -0.0184372 0.03361 0.0552101 1.2487401 0.0776564 -0.019579 0.0952733 -0.043854 -0.0052265 0.0719869 -0.000597 -0.046855 0.0417211 -0.0536119 -0.2339425 -0.0813459 -0.0214743 0.0244438 -0.4064172 0.0134974 0.1433141 0.1155061 -0.0044777 -0.0482073 -0.0053224 0.1519234 -0.0135582 -0.0161927 -0.0213741 0.0707095 0.095698 0.0167167 0.0675979 0.0025387 0.1564308 -0.0158799 0.0265489 -0.0062877 0.0940736 0.0407769 0.0005495 0.0478424 0.0029556 0.158409 -0.0179798 0.046392 -0.0186615 0.0524204 0.0438924 -0.0243711 -0.0758079 -0.0164531 0.1591248 -0.0382629 -0.0609883 -0.0368226 0.0138344 0.1987265 -0.1035365 -0.0375216 -0.0593472 0.193092 0.0242849 -0.0042592 0.0704649 0.110487 0.1604757 -0.0420715 0.0821785 -0.0356371 0.1384269 -0.0496915 0.0321629 -0.1051003 0.2104326 unknown
polarizability: 200.6667391|9.4268711|75.7861255|-14.4920149|13.0425402|133.5191394 unknown
InChI: InChI=1S/C7H6N2O2S2/c8-5-12-6-1-3-7(4-2-6)13(9,10)11/h1-4H,9H2
charge 0 multiplicity 1
19 atoms
S  2.931043 0.094475 0.195073
S  -3.467406 -0.476808 -0.799953
O  3.223945 -0.171062 1.774383
O  3.650433 -0.723838 -1.015312
N  3.262628 1.875787 -0.11815
N  -4.713205 0.069972 1.802344
C  1.070729 -0.044015 -0.061023
C  0.233813 0.124238 1.05186
C  0.600846 -0.344073 -1.34912
C  -1.160325 -0.00056 0.863911
C  -0.792571 -0.467465 -1.532928
C  -1.654663 -0.287044 -0.425852
C  -4.171826 -0.147677 0.755411
H  0.655471 0.321696 2.042443
H  1.29937 -0.50003 -2.176967
H  -1.837617 0.123563 1.714784
H  -1.189713 -0.702302 -2.525835
H  3.614097 2.299297 0.756735
H  3.931351 1.943745 -0.903404
