program: Gaussian 09
title: 000296282
version: EM64L-G09RevD.01
frameworkgroup: C1[X(C6H14O3)]
method: RPBEPBE
basis: SDD
operation: Freq
keyword: #pfreq=noraman
keyword: PBEPBE/SDD
title: #p freq=noraman PBEPBE/SDD
converged: YES YES NO NO
title: Mulliken charges:
elementType: O O O C C C C C C H H H H H H H H H H H H H H
charge: -0.289122 -0.263375 -0.291320 -0.006460 0.003807 -0.703605 -0.518606 -0.531727 -0.510558 0.199619 0.223159 0.219158 0.227636 0.228720 0.244789 0.222500 0.193277 0.235299 0.208723 0.231477 0.228741 0.234206 0.213661
chargesum: 0.00000
title: Mulliken charges with hydrogens summed into heavy atoms:
elementType: O O O C C C C C C
charge: -0.289122 -0.263375 -0.291320 0.193159 0.226967 -0.028091 0.141960 0.143771 0.166051
polarizability: 8.17514113e+01 2.49993977e+00 8.34234713e+01 -1.07384026e+00 -6.53331423e-01 6.50552691e+01
1716.lowfreq: -2.0161 -0.0008 -0.0008 -0.0006 6.5349 11.3738 59.7394 92.1443 103.8392
frequency: 59.7332 92.1384 103.8300 135.4517 139.8014 160.0168 176.0754 182.7036 194.1869 245.2886 283.4101 311.8884 334.7451 397.8803 480.1477 505.6943 596.7752 808.1319 846.4989 871.7620 923.7559 987.1730 1021.2841 1046.8018 1065.1321 1102.7348 1110.1776 1113.0470 1113.9999 1128.3020 1152.0214 1161.4666 1180.5338 1274.7938 1308.9049 1321.0373 1351.5848 1391.5039 1419.1231 1425.4530 1431.8492 1449.3544 1455.2600 1455.8006 1465.0824 1476.3684 1477.0431 1485.0384 1487.6949 2940.6702 2953.2394 2959.2129 2962.9702 2999.8072 3008.3269 3045.7493 3050.6589 3053.3808 3097.7315 3103.0783 3108.4547 3108.9427 3113.7784
redmass: 3.1464 1.9460 1.8520 1.3951 2.0480 1.1598 1.0453 1.5988 2.2318 3.7678 3.3706 3.1197 3.5692 5.0226 3.4369 2.9020 5.0001 2.9753 4.5667 2.6465 2.6338 9.0321 3.6719 4.8534 2.6473 1.8973 1.2724 1.3186 1.3373 1.5297 1.4180 1.5657 1.8990 1.3378 1.2099 1.2547 1.3566 1.2280 1.1224 1.1358 1.1468 1.0560 1.0457 1.0521 1.0580 1.0531 1.0518 1.0509 1.0529 1.0393 1.0660 1.0338 1.0487 1.0363 1.0857 1.0927 1.1004 1.1010 1.0991 1.1025 1.1005 1.1013 1.1015
irintensity: 0.6144 3.5338 3.4451 1.9072 2.2276 0.3768 0.1387 4.5654 2.3008 20.2894 8.7879 13.3185 3.9564 0.7391 15.2970 3.8261 2.9720 10.4425 26.0097 46.5826 6.5555 184.8712 46.9051 122.1541 82.9397 18.1436 0.4921 5.3711 1.0267 2.6064 5.1777 6.3089 3.7047 5.6640 2.4808 2.2301 3.1386 26.4419 4.4182 2.7131 9.3722 3.4116 7.9516 10.2769 5.3765 15.4702 11.4274 9.9869 4.9140 78.4366 6.0835 76.3245 70.3595 15.7608 46.9347 44.4897 30.7053 61.3145 27.6628 31.0391 33.4073 18.6856 23.9466
temp: 298.150 k
press: 1.00000 atm
elementType: 8 8 8 6 6 6 6 6 6 1 1 1 1 1 1 1 1 1 1 1 1 1 1
symmnumber: 1
zpe: 515677.1 jmol-1
zpe.correction: 0.196411 hartree
zpe.thermalcorrener: 0.208575 hartree
zpe.thermalcorrenthalpy: 0.209519 hartree
zpe.thermalcorrgfe: 0.158718 hartree
zpe.sumelectzpe: -461.881092 hartree
zpe.sumelectthermal: -461.868928 hartree
zpe.sumelectthermalent: -461.867984 hartree
zpe.sumelectthermalfe: -461.918785 hartree
dipole: -1.1504 0.7580 1.5351
dipole: 2.0627
quadrupole: -56.4977 -51.8292 -55.2065
quadrupole: -0.9383 0.6621 -3.2484
quadrupole: -1.9866 2.6820 -0.6953 -0.9383 0.6621 -3.2484
hfenergy: -462.077503 hartree
pointgroup: C01 [X(C6H14O3)]
dipole: -0.431259 -0.1762407 -0.6644714 debye
dipolederiv: -0.7136044 0.2567648 0.1626824 0.2824203 -0.7759605 -0.171801 0.1052716 -0.0997774 -0.4348303 -0.7322122 0.3297534 -0.1586566 0.1234938 -0.8482924 0.1281396 -0.1916132 0.1618648 -0.5281083 -0.7255869 -0.2969308 -0.0405529 -0.1907009 -1.046239 0.0204789 -0.0247731 -0.2071612 -0.388902 0.4947893 -0.1875057 -0.0791658 -0.1752962 0.4512871 0.0470234 0.0335918 -0.0969781 0.2680118 0.7611102 -0.2028749 0.1983807 -0.0758245 1.1762861 -0.0338537 0.1605586 0.297489 0.4115762 -0.0186083 -0.0475394 -0.0074577 0.0099695 -0.1241514 -0.0862688 0.0060311 -0.0711627 0.0265527 0.3026166 -0.0606201 -0.102246 -0.1457055 0.4526368 0.0923712 -0.2246734 0.1856884 0.4119599 0.2919491 0.0095669 0.0674784 0.0025502 0.3678786 -0.0991015 0.1762694 -0.2555264 0.3924941 0.43603 0.2378775 -0.0180637 0.1389729 0.4459893 -0.0875775 -0.0585206 -0.1631796 0.2767304 0.0038568 0.0343629 -0.0019027 0.0165221 0.011591 -0.0120985 -0.035974 0.0644702 -0.1806153 0.0155716 0.0262642 -0.0157245 0.0020444 -0.0306194 0.0712972 -0.0411303 0.0213601 -0.1432699 -0.0082056 0.1420095 -0.0212804 0.1286679 -0.0215176 0.0073847 -0.0215076 0.0270336 0.0864433 -0.0937348 -0.1173034 0.0481405 -0.0953294 0.0390481 0.0113126 0.0731669 0.0241922 0.0639836 0.1059662 -0.0162125 -0.0056416 0.0042023 0.0781288 0.0796444 -0.0268459 0.0108093 -0.1175835 0.0287537 -0.1447549 -0.0473418 -0.0910048 -0.0592296 -0.0526895 0.0050238 -0.082511 0.0317678 -0.0805482 0.1446747 -0.0405223 0.1260684 -0.0052013 0.0169674 -0.0714272 0.0284165 0.0560858 0.0435317 -0.0072766 0.0646744 -0.0387133 -0.0312507 0.1192772 0.1488685 0.0118323 -0.1781118 0.0924797 -0.0160217 0.0111992 -0.0336249 -0.0095133 -0.1319466 -0.0484471 -0.0441157 -0.0778947 -0.0407612 -0.1637399 0.0619469 -0.1053089 -0.0758875 0.0787969 0.0063801 0.0885782 -0.0003175 -0.113785 0.1236119 -0.0175108 0.1002813 0.0395781 0.0266841 0.0120689 0.0157142 0.0863071 0.0766056 -0.0450527 -0.0022425 -0.0713431 -0.0569484 -0.096621 -0.0252904 -0.1300931 -0.0083919 -0.1447241 0.015687 0.0180868 0.116709 0.0221792 -0.0016301 0.0428891 0.0405613 0.0787294 0.0185101 -0.0147401 -0.0742801 -0.0290505 0.0002083 0.0742106 0.0000833 0.1724951 -0.1326167 unknown
polarizability: 81.0320649|-2.4738421|83.8518065|1.9683565|1.2590097|65.3462803 unknown
InChI: InChI=1S/C6H14O3/c1-5(7-2)6(8-3)9-4/h5-6H,1-4H3
charge 0 multiplicity 1
23 atoms
O  2.090982 -0.255223 0.427496
O  -1.449856 1.093433 0.423777
O  -0.620743 -1.01582 -0.399225
C  1.026998 0.696228 0.063022
C  -0.352797 0.120681 0.469863
C  1.343266 1.990095 0.82267
C  2.412946 -1.249786 -0.60331
C  -1.713017 1.657515 -0.912076
C  -1.73304 -1.854332 0.077837
H  1.035503 0.866266 -1.036039
H  -0.333198 -0.187031 1.534791
H  0.541196 2.737139 0.699123
H  2.297308 2.411149 0.463792
H  1.447969 1.773572 1.900533
H  1.550875 -1.907488 -0.814064
H  3.25402 -1.833812 -0.195447
H  2.733674 -0.756078 -1.545632
H  -1.735194 0.861868 -1.679826
H  -0.957048 2.418832 -1.189984
H  -2.700927 2.138423 -0.838905
H  -1.867963 -2.640644 -0.680928
H  -2.660409 -1.260826 0.180257
H  -1.483743 -2.31536 1.05477
