program: Gaussian 09
title: 000027272
version: EM64L-G09RevD.01
frameworkgroup: C1[X(C7H11N3O8)]
method: RPBEPBE
basis: SDD
operation: Freq
keyword: #p
keyword: freq=noraman
keyword: PBEPBE/SDD
title: #p freq=noraman PBEPBE/SDD
converged: YES YES NO NO
title: Mulliken charges:
elementType: O O O O O O O O N N N C C C C C C C H H H H H H H H H H H
charge: -0.268106 -0.241326 -0.153036 -0.147834 -0.151179 -0.131239 -0.123759 -0.125373 0.099295 0.114335 0.104601 0.285182 -0.399060 -0.533542 0.261705 0.032489 -0.681085 -0.679246 0.276702 0.292538 0.265136 0.299004 0.235340 0.213059 0.233868 0.226733 0.218915 0.252250 0.223636
chargesum: 0.00000
title: Mulliken charges with hydrogens summed into heavy atoms:
elementType: O O O O O O O O N N N C C C C C C C
charge: -0.268106 -0.241326 -0.153036 -0.147834 -0.151179 -0.131239 -0.123759 -0.125373 0.099295 0.114335 0.104601 0.285182 0.170179 0.030597 0.261705 0.267829 -0.007426 0.015554
polarizability: 1.65381973e+02 -6.37063814e-01 1.19357301e+02 3.86323825e+00 2.35577364e+00 1.15259288e+02
1716.lowfreq: 0.0006 0.0008 0.0009 1.0851 5.6338 6.7946 12.2147 23.0555 29.7534
frequency: 11.6009 23.0323 29.7169 43.7388 63.0728 65.9747 78.2049 92.2757 132.1555 134.7435 152.9625 167.9432 179.9259 187.2806 227.4742 238.9222 254.3384 264.9040 325.1304 334.6443 344.2053 363.7188 384.0732 421.1289 460.3939 492.1682 559.2223 562.1396 588.2212 642.2566 691.0731 702.2518 723.7169 744.6506 761.6276 775.7545 828.0993 829.7284 888.9200 928.0418 932.9900 944.5653 1044.4319 1056.7395 1096.6466 1135.2969 1157.3734 1160.9409 1162.4258 1164.5572 1186.6804 1196.2677 1220.9177 1276.8408 1302.0129 1328.8656 1335.6328 1367.8692 1383.6185 1399.4227 1422.3570 1428.6906 1439.1229 1449.4885 1453.3458 1457.5544 1465.1713 1472.6206 1486.6478 1627.4967 2992.0819 2995.6162 3021.6212 3030.2599 3034.2917 3084.2330 3087.4420 3095.9857 3100.7069 3102.7523 3106.1713
redmass: 4.3511 13.4807 5.2774 11.7586 5.4832 5.4223 14.3501 4.9505 3.1506 3.2605 7.5654 11.5690 6.8975 1.0284 1.3020 8.3072 3.8350 3.2650 3.2662 14.7108 8.7702 13.9188 3.5656 3.0892 3.3458 6.1109 2.7503 9.6015 7.8424 7.8486 4.0643 7.1434 10.8337 3.8669 7.1518 5.0548 2.8348 5.7249 2.8659 1.2526 2.8585 1.6218 2.3292 4.9625 1.7831 4.6683 2.4817 3.1650 6.9947 10.7885 1.9205 1.2309 10.4277 1.3624 1.1876 1.4010 1.3833 1.6210 1.2565 1.2287 1.3626 7.1991 6.4598 1.7498 2.1512 1.0522 1.0468 1.0498 1.0490 9.1941 1.0357 1.0360 1.0627 1.0867 1.0610 1.0977 1.0993 1.0988 1.1009 1.1011 1.1007
irintensity: 0.6795 0.0379 0.1071 0.2704 1.4579 1.0695 0.1282 2.6693 0.9816 0.4203 2.7349 2.8345 6.1055 0.0194 1.1177 3.9188 16.8197 1.3231 0.0494 3.0650 0.9140 1.4120 10.4825 2.2829 0.1145 10.8995 1.5386 1.1407 0.8608 5.3124 4.5751 8.7026 67.9752 69.1748 32.1486 11.1834 1.2032 5.2860 7.6754 2.5834 29.6700 5.8601 1.4359 12.0523 183.2669 6.2517 151.4727 230.9840 62.6696 115.8719 2.8806 4.3018 6.8978 153.6396 53.2942 4.9429 3.1564 26.9013 34.7772 16.1963 51.2258 65.4665 174.9873 92.6418 61.6835 7.2059 4.3148 7.3147 20.6040 158.7045 13.2539 18.4223 5.9604 6.4232 10.5760 4.1080 5.4805 44.7462 16.3817 0.5353 31.9463
temp: 298.150 k
press: 1.00000 atm
elementType: 8 8 8 8 8 8 8 8 7 7 7 6 6 6 6 6 6 6 1 1 1 1 1 1 1 1 1 1 1
symmnumber: 1
zpe: 525801.7 jmol-1
zpe.correction: 0.200267 hartree
zpe.thermalcorrener: 0.220065 hartree
zpe.thermalcorrenthalpy: 0.221009 hartree
zpe.thermalcorrgfe: 0.148083 hartree
zpe.sumelectzpe: -1037.707078 hartree
zpe.sumelectthermal: -1037.687280 hartree
zpe.sumelectthermalent: -1037.686336 hartree
zpe.sumelectthermalfe: -1037.759262 hartree
dipole: 5.5073 0.1929 0.2315
dipole: 5.5155
quadrupole: -100.9918 -112.4996 -112.7656
quadrupole: 2.6526 1.6911 -2.5088
quadrupole: 7.7605 -3.7472 -4.0133 2.6526 1.6911 -2.5088
hfenergy: -1037.907345 hartree
pointgroup: C01 [X(C7H11N3O8)]
dipole: 2.1642451 0.1085092 0.1142468 debye
polarizability: 165.0372108|1.6802464|120.1624826|5.489853|-1.187274|114.7988692 unknown
InChI: InChI=1S/C7H11N3O8/c1-5(2)18-6(11)3-4-7(8(12)13,9(14)15)10(16)17/h5H,3-4H2,1-2H3
charge 0 multiplicity 1
29 atoms
O  3.154907 0.462748 0.043626
O  2.210608 -1.665269 -0.172388
O  -1.472065 0.964701 -2.201097
O  -2.770383 -2.245775 0.065155
O  -1.354242 0.799922 2.181139
O  -2.406944 2.257408 -0.55909
O  -3.738546 -0.750247 -1.372215
O  -3.523806 0.402516 1.587525
N  -1.910201 1.176461 -1.018755
N  -2.874881 -1.109393 -0.510571
N  -2.267145 0.423581 1.37007
C  -1.787195 -0.051034 -0.052559
C  -0.395567 -0.669001 -0.079225
C  0.77296 0.331789 0.053118
C  2.095682 -0.423068 -0.037824
C  4.555916 -0.120516 -0.011216
C  5.439884 1.016739 -0.523282
C  4.929227 -0.630616 1.386655
H  -0.295274 -1.214676 -1.034597
H  -0.346542 -1.430026 0.718041
H  0.758131 1.090097 -0.750925
H  0.739998 0.873174 1.012795
H  4.51947 -0.962483 -0.727352
H  6.48346 0.665495 -0.614214
H  5.102196 1.365537 -1.513896
H  5.420106 1.872217 0.174266
H  5.956544 -1.038115 1.371772
H  4.248158 -1.435846 1.709147
H  4.893345 0.191079 2.123398
