program: Gaussian 09
title: 000296279
version: EM64L-G09RevD.01
frameworkgroup: C1[X(C13H23NO2)]
method: RPBEPBE
basis: SDD
operation: Freq
keyword: #p
keyword: freq=noraman
keyword: PBEPBE/SDD
title: #p freq=noraman PBEPBE/SDD
converged: YES YES NO NO
title: Mulliken charges:
elementType: O O N C C C C C C C C C C C C C H H H H H H H H H H H H H H H H H H H H H H H
charge: -0.277482 -0.200365 -0.007802 0.237814 -0.440766 -0.439867 -0.368241 -0.367990 0.155699 -0.354360 -0.354565 -0.240648 -0.699525 -0.699512 -0.221333 -0.672443 0.225692 0.213770 0.213598 0.225556 0.226607 0.201079 0.200733 0.226315 0.193825 0.199511 0.199482 0.193960 0.217099 0.217882 0.210711 0.217788 0.217141 0.210654 0.232224 0.231236 0.229883 0.229836 0.216804
chargesum: 0.00000
title: Mulliken charges with hydrogens summed into heavy atoms:
elementType: O O N C C C C C C C C C C C C C
charge: -0.277482 -0.200365 -0.007802 0.237814 -0.001304 -0.000712 0.059445 0.059058 0.155699 0.038976 0.038877 -0.240648 -0.053832 -0.053929 0.242126 0.004080
polarizability: 1.61298942e+02 2.66765308e-01 1.54198135e+02 -2.45570562e-01 -8.48246088e+00 1.33280924e+02
1716.lowfreq: -11.5812 -3.9300 -0.0004 0.0004 0.0007 4.1187 10.1289 35.2089 47.5281
frequency: -1.2066 35.1033 47.2583 52.8991 59.2272 60.9893 62.3528 90.2969 104.5576 119.4986 130.2517 138.2733 169.7254 187.1058 217.9543 224.3352 227.4994 237.6605 257.6553 260.1277 289.7411 343.4801 387.5147 406.9104 418.7351 439.0578 465.3107 591.6832 640.3045 726.6481 729.4234 737.2873 756.4456 787.9196 792.2769 797.5792 818.3966 890.5944 894.7356 895.4486 924.1376 977.8400 981.2541 1022.3196 1029.8943 1054.9778 1060.8657 1079.9497 1086.7849 1101.7758 1102.1342 1112.1024 1114.8993 1134.9967 1136.5055 1192.6217 1212.4251 1248.2177 1251.6269 1255.3273 1271.9684 1280.5378 1296.2453 1298.8720 1318.9753 1323.5601 1335.2454 1355.3207 1356.6028 1366.2850 1390.7732 1391.2204 1399.8385 1450.1778 1463.3190 1463.5497 1467.2120 1467.4077 1473.9414 1475.8513 1476.7093 1477.1144 1477.2724 1486.3969 1487.2988 1487.6037 1633.6425 2196.3599 2962.6961 2962.9221 2971.1041 2971.6879 2975.1220 2975.3319 2989.3630 2993.1359 2996.2154 3004.6146 3004.8052 3012.1313 3029.8857 3031.0823 3059.1276 3063.7459 3070.6425 3071.9443 3072.3438 3074.8132 3074.9260 3092.9429 3107.7476
redmass: 2.7838 3.2275 2.3261 3.0716 1.9479 5.1735 1.8248 3.3683 4.7345 3.3242 2.4982 2.5713 3.8006 2.8890 1.3029 1.8145 1.6416 1.3839 3.4546 1.6869 3.8218 3.5393 2.8889 5.5346 5.8213 4.4875 3.7208 6.0541 4.6383 1.5824 1.1577 2.1148 2.0611 1.2155 2.4565 1.1226 2.4591 1.8243 1.8047 1.8470 1.2357 5.5947 1.5843 2.3924 2.8220 3.0919 3.5426 2.4225 2.6274 1.3844 3.2920 2.6093 2.3424 1.4661 3.2201 2.0794 1.3954 1.1363 1.5472 1.2836 1.3276 1.1776 1.1160 1.0622 1.3633 1.2828 1.3957 1.3877 1.5645 1.5286 1.2125 1.2151 1.2617 1.0766 1.0792 1.0410 1.0728 1.0713 1.0593 1.0650 1.0573 1.0445 1.0499 1.0713 1.0822 1.0822 11.7969 12.6418 1.0588 1.0589 1.0605 1.0605 1.0363 1.0366 1.0600 1.0594 1.0359 1.0984 1.0985 1.0582 1.1021 1.1023 1.1041 1.1028 1.1064 1.1008 1.1007 1.0996 1.0996 1.0985 1.1028
irintensity: 0.1047 0.0490 0.5273 0.3564 0.6355 0.1553 0.3474 0.4584 1.7139 2.6038 0.2616 2.7147 1.6053 2.1445 0.3981 0.0675 0.0556 0.0009 0.2392 2.1698 3.4699 9.6352 0.6137 2.0292 2.0178 0.7418 1.2297 4.7621 5.5423 0.3332 18.3644 1.1087 0.7518 0.6356 3.8746 3.1255 3.2594 1.7233 3.7456 3.9759 0.1062 3.6689 26.1602 60.5315 9.7624 8.7219 2.0021 3.7524 2.0242 16.3186 256.2243 9.6367 58.8025 5.7308 20.3085 19.6427 0.0201 0.0072 6.3608 2.8271 3.8380 0.0031 0.0432 0.1688 0.1242 1.5814 5.3032 1.2180 6.9262 0.7353 12.5254 10.6362 23.8439 0.0020 5.6659 12.4054 0.2652 0.0284 4.7309 4.9550 9.1180 1.6389 16.8422 2.2791 2.0867 41.7285 149.5386 4.3642 2.6060 22.6068 6.7070 53.5231 54.4776 20.6769 1.6917 69.3960 20.0855 0.5462 5.1420 16.9400 0.0657 29.7970 0.2177 21.4420 7.6695 5.1321 171.9212 30.0973 74.7960 26.5932 41.9611
temp: 298.150 k
press: 1.00000 atm
elementType: 8 8 7 6 6 6 6 6 6 6 6 6 6 6 6 6 1 1 1 1 1 1 1 1 1 1 1 1 1 1 1 1 1 1 1 1 1 1 1
symmnumber: 1
zpe: 882309.0 jmol-1
zpe.correction: 0.336054 hartree
zpe.thermalcorrener: 0.355742 hartree
zpe.thermalcorrenthalpy: 0.356686 hartree
zpe.thermalcorrgfe: 0.286569 hartree
zpe.sumelectzpe: -713.085851 hartree
zpe.sumelectthermal: -713.066163 hartree
zpe.sumelectthermalent: -713.065219 hartree
zpe.sumelectthermalfe: -713.135336 hartree
dipole: 0.0693 4.1503 -4.3160
dipole: 5.9881
quadrupole: -93.3244 -98.0919 -109.6329
quadrupole: 0.0045 0.2245 8.6263
quadrupole: 7.0254 2.2578 -9.2832 0.0045 0.2245 8.6263
hfenergy: -713.4219044 hartree
pointgroup: C01 [X(C13H23N1O2)]
dipole: 0.0459611 1.7269927 -1.6017727 debye
polarizability: 161.3011389|0.1336336|155.0944159|-0.5266355|-7.2231465|132.3824457 unknown
InChI: InChI=1S/C13H23NO2/c1-4-7-9-13(11-14,10-8-5-2)12(15)16-6-3/h4-10H2,1-3H3
charge 0 multiplicity 1
39 atoms
O  0.058679 1.795386 0.024826
O  0.00521 0.693991 2.074971
N  -0.069299 -2.816111 1.44045
C  -0.020975 -0.608143 -0.063933
C  -1.311334 -0.586361 -0.961787
C  1.257355 -0.653946 -0.977366
C  -2.642456 -0.527225 -0.183665
C  2.598636 -0.660097 -0.214731
C  0.014878 0.656352 0.827492
C  -3.867323 -0.551935 -1.126506
C  3.810882 -0.731531 -1.171397
C  -0.047278 -1.808462 0.803746
C  -5.207305 -0.485163 -0.363079
C  5.160593 -0.731005 -0.422257
C  0.093977 3.106253 0.750398
C  0.166259 4.196757 -0.312182
H  -1.225774 0.28969 -1.631592
H  -1.292026 -1.49464 -1.595635
H  1.184462 -1.561383 -1.608515
H  1.208385 0.224064 -1.648209
H  -2.704485 -1.380614 0.520261
H  -2.679323 0.393169 0.434318
H  2.682758 0.253801 0.408369
H  2.631071 -1.520285 0.482838
H  -3.801438 0.29742 -1.837239
H  -3.836173 -1.475493 -1.739986
H  3.73238 -1.647678 -1.791749
H  3.774965 0.125854 -1.874489
H  -6.068258 -0.506714 -1.055902
H  -5.310009 -1.339696 0.331468
H  -5.277733 0.442463 0.235614
H  5.231013 -1.59371 0.266187
H  6.012293 -0.787768 -1.124455
H  5.280017 0.188649 0.180973
H  0.971837 3.10405 1.421287
H  -0.815082 3.17733 1.374451
H  -0.71297 4.160887 -0.977893
H  1.075561 4.090157 -0.927995
H  0.191931 5.188588 0.174714
