program: Gaussian 09
title: 000296252
version: EM64L-G09RevD.01
frameworkgroup: C1[X(C12H19NO)]
method: RPBEPBE
basis: SDD
operation: Freq
keyword: #p
keyword: freq=noraman
keyword: PBEPBE/SDD
title: #p freq=noraman PBEPBE/SDD
converged: YES YES NO NO
title: Mulliken charges:
elementType: O N C C C C C C C C C C C C H H H H H H H H H H H H H H H H H H H
charge: -0.450100 -0.077063 -0.165002 0.079001 0.406398 -0.451752 -0.454788 -0.557166 0.140221 -0.435785 -0.415721 -0.437643 -0.726936 -0.769508 0.208090 0.211048 0.227884 0.198191 0.205235 0.217030 0.275498 0.209949 0.205294 0.236358 0.210688 0.210873 0.213731 0.227191 0.228032 0.232986 0.203730 0.231113 0.362926
chargesum: 0.00000
title: Mulliken charges with hydrogens summed into heavy atoms:
elementType: O N C C C C C C C C C C C C
charge: -0.087174 -0.077063 0.043088 0.079001 0.406398 -0.012820 -0.051362 -0.064638 0.140221 -0.020543 -0.179363 -0.016082 -0.057983 -0.101679
polarizability: 1.64154252e+02 5.97161436e+00 1.29836470e+02 3.32507165e+00 -4.81656080e+00 1.16541232e+02
1716.lowfreq: -13.7933 -11.3667 -0.0008 -0.0003 0.0000 14.6146 42.3983 82.3505 145.5413
frequency: 42.1731 82.3437 145.5382 166.5791 202.5940 207.0776 238.5224 255.3886 277.6246 297.9586 309.6815 322.2687 332.3356 343.0951 380.7931 385.6322 426.2511 455.2099 493.1026 517.6526 531.5491 596.8614 636.6093 676.4179 722.5684 768.8101 808.2806 824.4783 829.5338 860.4645 868.1568 879.4216 924.1436 942.5753 953.7534 968.6664 1002.5163 1009.6080 1037.7741 1041.2448 1080.6380 1096.5727 1104.3119 1126.8177 1145.0701 1149.0599 1173.1126 1184.9422 1203.3170 1215.3453 1235.8210 1258.1832 1285.1799 1301.6192 1309.8471 1321.2100 1328.2598 1336.2115 1340.5861 1348.2979 1371.9535 1373.8581 1396.6060 1455.5666 1457.4843 1464.0290 1466.2769 1467.2199 1471.9879 1473.1280 1479.0174 1493.5523 1596.2082 1671.9806 2944.8214 2947.5690 2972.1701 2973.8644 2979.1370 2982.4761 2983.8729 2993.6786 3006.9165 3026.7694 3041.3105 3045.7829 3080.2974 3080.8016 3087.9017 3089.9236 3103.4535 3125.7321 3567.7057
redmass: 4.6574 2.7826 2.7315 2.4725 1.5742 2.8928 1.8117 2.5999 2.3075 1.7199 4.0317 1.3089 3.4100 2.7268 2.4259 2.0731 1.4704 2.6321 2.9091 3.9514 3.0082 3.9513 3.0882 3.0093 2.4805 2.7808 1.6653 1.7999 2.8952 2.1654 3.8313 1.6098 1.8796 1.7145 2.1101 2.1906 1.3576 1.6347 2.3102 2.2823 1.8604 1.7356 1.8465 1.2871 2.3768 1.6384 1.6433 1.7694 1.9057 1.4560 2.1389 1.2524 1.3205 1.5121 1.3681 1.4884 1.8203 1.3911 1.4264 1.4964 1.5470 1.2473 1.2012 1.0858 1.0701 1.0865 1.0720 1.0800 1.0489 1.0918 1.0542 1.0565 7.7758 7.3912 1.0784 1.0649 1.0673 1.0628 1.0600 1.0638 1.0368 1.0365 1.0919 1.0989 1.1024 1.1030 1.0949 1.0982 1.0992 1.0987 1.0989 1.0897 1.0673
irintensity: 0.0067 0.0709 0.2204 1.3458 0.2189 0.1757 0.4826 0.3384 0.1032 0.1481 5.7264 1.1560 4.1528 2.7220 20.8057 17.8644 92.9282 7.9357 1.3450 2.8919 4.5696 1.9636 24.4204 5.1384 2.9201 0.5336 14.8677 0.2159 32.9604 4.3673 135.9720 22.9796 2.0357 2.4127 9.3708 5.1873 1.2245 10.1996 4.9469 0.3357 1.0028 4.1545 5.9147 3.3203 4.6893 15.9042 1.2346 1.4635 2.8700 24.9982 23.5232 2.3672 0.5564 15.0902 1.2365 6.2397 2.3073 3.7253 7.9211 1.2086 5.2758 15.4922 18.7702 10.0748 4.9252 4.8443 17.2857 11.1624 1.1580 12.0261 14.0108 11.1270 4.3016 1.3786 19.6140 46.3207 18.1001 38.4945 32.0396 45.6347 34.0330 20.9798 41.8625 55.3737 45.6375 72.0339 15.1280 11.2778 31.8450 35.3244 30.6261 18.0551 38.6235
temp: 298.150 k
press: 1.00000 atm
elementType: 8 7 6 6 6 6 6 6 6 6 6 6 6 6 1 1 1 1 1 1 1 1 1 1 1 1 1 1 1 1 1 1 1
symmnumber: 1
zpe: 753544.0 jmol-1
zpe.correction: 0.287010 hartree
zpe.thermalcorrener: 0.300811 hartree
zpe.thermalcorrenthalpy: 0.301755 hartree
zpe.thermalcorrgfe: 0.247908 hartree
zpe.sumelectzpe: -597.496877 hartree
zpe.sumelectthermal: -597.483076 hartree
zpe.sumelectthermalent: -597.482132 hartree
zpe.sumelectthermalfe: -597.535979 hartree
dipole: 1.0465 -0.1540 0.4998
dipole: 1.1699
quadrupole: -82.5691 -85.4188 -83.1283
quadrupole: -0.7619 1.3059 -0.8725
quadrupole: 1.1363 -1.7134 0.5771 -0.7619 1.3059 -0.8725
hfenergy: -597.7838867 hartree
pointgroup: C01 [X(C12H19N1O1)]
dipole: -0.4088779 0.0565594 0.2036163 debye
polarizability: 164.0938375|6.0313004|129.5448438|-3.7869333|5.0838478|116.893272 unknown
InChI: InChI=1S/C12H19NO/c1-12(2)10-6-4-3-5-9(10)7-8-11(12)13-14/h6,9,14H,3-5,7-8H2,1-2H3
charge 0 multiplicity 1
33 atoms
O  3.480609 1.154421 -1.152307
N  2.700345 -0.066481 -0.82414
C  -1.085745 0.756024 0.811381
C  0.803023 -0.989838 0.390973
C  -0.669533 -0.563779 0.155839
C  -0.19113 1.899808 0.256597
C  -2.602831 1.050088 0.670469
C  1.314516 1.594685 0.464093
C  1.682276 0.210377 -0.040239
C  -3.147563 0.672692 -0.723731
C  -1.525503 -1.273496 -0.631735
C  -2.940861 -0.83746 -0.971056
C  1.054468 -1.257846 1.915475
C  1.191186 -2.277649 -0.372671
H  -0.867742 0.688142 1.899034
H  -0.442323 2.852131 0.763726
H  -0.393277 2.035903 -0.82338
H  -2.789903 2.119938 0.888949
H  -3.157809 0.465942 1.432261
H  1.547435 1.65094 1.547608
H  1.945174 2.34526 -0.039467
H  -2.614534 1.248737 -1.505429
H  -4.219854 0.934652 -0.802791
H  -1.19099 -2.213987 -1.085939
H  -3.155043 -1.087698 -2.029302
H  -3.671582 -1.420699 -0.369702
H  0.857551 -0.374896 2.547085
H  0.396889 -2.077085 2.258735
H  2.105143 -1.560735 2.074421
H  2.249377 -2.524106 -0.187184
H  0.568783 -3.123842 -0.028831
H  1.06902 -2.1600 -1.462549
H  4.172132 0.781755 -1.75719
