program: Gaussian 09
title: 000296280
version: EM64L-G09RevD.01
frameworkgroup: C1[X(C16H25NO2)]
method: RPBEPBE
basis: SDD
operation: Freq
keyword: #p
keyword: freq=noraman
keyword: PBEPBE/SDD
title: #p freq=noraman PBEPBE/SDD
converged: YES YES NO NO
title: Mulliken charges:
elementType: O O N C C C C C C C C C C C C C C C C H H H H H H H H H H H H H H H H H H H H H H H H H
charge: -0.262934 -0.252040 -0.095940 -0.020247 -0.349974 -0.386946 0.453504 -0.743837 0.198549 -0.717473 -0.435118 -0.392441 -0.299854 -0.348251 -0.231722 -0.241901 -0.242921 -0.616615 -0.615550 0.207188 0.245837 0.229486 0.230397 0.216872 0.217456 0.225233 0.219337 0.207057 0.215600 0.230217 0.282283 0.232904 0.239149 0.213146 0.219593 0.224105 0.224966 0.227507 0.224184 0.227895 0.190948 0.231912 0.224489 0.193952
chargesum: 0.00000
title: Mulliken charges with hydrogens summed into heavy atoms:
elementType: O O N C C C C C C C C C C C C C C C C
charge: -0.262934 -0.252040 -0.095940 0.186942 -0.104136 0.072937 0.453504 -0.084276 0.198549 -0.075479 -0.204901 -0.110159 0.172198 0.084489 -0.007617 -0.016935 -0.015415 0.026411 0.034803
polarizability: 2.30363697e+02 1.82701933e+01 1.58609430e+02 -8.91555559e-01 -8.37051871e+00 1.67206097e+02
1716.lowfreq: -16.7657 -8.3221 -5.8322 0.0003 0.0007 0.0008 1.9625 20.0601 21.9165
frequency: -8.7085 19.8750 21.7774 38.9125 48.2008 58.0873 63.5633 89.9961 93.8765 130.7885 147.1603 189.8088 194.3904 205.2508 216.7591 220.2848 236.4510 253.3856 279.8302 287.7755 301.9442 325.3484 349.7093 377.7687 405.5948 411.6748 415.5871 458.4838 503.1371 522.5710 613.1430 621.6685 696.2731 707.7215 717.3155 742.6824 777.2745 789.4902 802.6246 818.3545 840.1940 859.6331 872.1861 915.0308 929.8699 953.8883 965.9857 982.2998 989.3358 990.6160 1000.4899 1029.7191 1030.8808 1038.0929 1043.9281 1064.3950 1071.9093 1080.2775 1089.7983 1094.7244 1100.7331 1137.6397 1139.1251 1164.8314 1172.2213 1185.3603 1195.4797 1199.2189 1237.5844 1257.8830 1270.4286 1271.0069 1273.6732 1295.6439 1318.2650 1325.2701 1332.5679 1348.2951 1363.6135 1376.9389 1384.0295 1387.8722 1392.7358 1421.3630 1440.6018 1441.9786 1450.5900 1461.5338 1464.6602 1468.5892 1474.3723 1474.9724 1477.8372 1480.3349 1482.8496 1483.8786 1486.5451 1490.2858 1590.9652 1611.5916 1626.8405 2856.1536 2865.4948 2886.2333 2956.9396 2972.3694 2974.3466 2994.6187 3020.0747 3023.3608 3028.6686 3041.3256 3044.0258 3046.7308 3062.4781 3070.2510 3076.1002 3079.0660 3082.6007 3088.7445 3113.2812 3125.6282 3129.3545 3138.8161 3152.1885 3163.9119
redmass: 3.2538 3.1199 4.3849 3.5568 2.6808 2.6550 3.1325 2.6173 3.2856 3.5588 4.1831 1.8256 1.0813 1.4504 2.5849 2.1147 1.3429 1.7552 3.2167 3.2842 2.6134 5.2414 2.7504 3.1194 2.8684 2.2389 2.5871 3.2336 3.7423 3.6939 5.7863 5.3124 4.7492 2.0765 3.4442 2.0287 1.4747 1.6308 1.6345 3.3248 3.7344 1.2706 3.4298 2.2755 1.7773 1.9321 1.4348 1.3665 2.1473 4.3465 1.3121 2.2620 2.1992 1.6345 2.9740 2.1201 1.9986 1.6894 1.3327 3.0489 1.8113 1.9464 1.6993 2.1101 1.0609 1.6548 1.1495 2.3777 1.3017 1.5950 1.8006 1.4547 1.3582 1.2180 1.3500 1.3569 1.3339 1.4233 1.5802 1.5714 1.2211 3.3366 1.2090 1.1392 1.2021 1.9233 1.1145 1.0527 1.0572 1.0600 1.0470 1.0547 1.0739 1.0778 2.0550 1.0967 1.0541 1.0527 6.0309 5.9320 8.3829 1.0566 1.0585 1.0677 1.0831 1.0364 1.0364 1.0602 1.0731 1.0838 1.0734 1.0730 1.0998 1.0750 1.0990 1.0990 1.1003 1.1007 1.0982 1.1008 1.0871 1.0866 1.1080 1.0923 1.0952 1.1010
irintensity: 0.3377 0.3682 0.4128 0.0204 0.5521 0.5090 0.2882 0.1471 0.5069 1.0126 2.2407 1.4273 0.1126 1.5588 0.9482 0.8806 0.1518 3.3330 4.3998 0.4912 0.5705 8.6245 18.0130 4.2010 0.0454 1.2252 5.3837 0.5827 11.5740 17.4444 0.5357 3.6271 7.4759 41.2085 12.0765 20.0804 18.4860 19.1966 0.7225 3.4661 4.1666 0.0880 4.6635 5.7289 23.6746 30.4054 25.2695 0.3353 7.0923 0.4582 0.1467 37.5467 6.2635 30.4956 7.6920 16.9550 92.4226 26.7087 5.5368 241.4155 19.2051 27.8276 23.1187 21.3598 0.6075 2.9096 0.6910 1.7394 6.0484 9.0876 1.4362 21.4456 13.6466 0.5692 9.8331 4.0255 9.6669 11.9197 9.5005 14.7544 11.4131 9.8643 13.5513 2.0771 2.7273 9.1748 5.4603 15.3364 8.2839 7.3368 6.0746 35.1842 21.5952 1.9021 30.6880 15.2467 9.8540 3.8798 3.1748 12.8021 99.4841 82.7013 125.4151 127.5638 18.7563 32.3234 41.5348 10.9341 45.7138 8.5214 37.4948 30.6310 1.7454 23.8656 22.9917 56.5476 64.7851 31.1412 37.9907 42.0696 8.4972 1.1842 14.7012 27.3164 17.6437 26.4145
temp: 298.150 k
press: 1.00000 atm
elementType: 8 8 7 6 6 6 6 6 6 6 6 6 6 6 6 6 6 6 6 1 1 1 1 1 1 1 1 1 1 1 1 1 1 1 1 1 1 1 1 1 1 1 1 1
symmnumber: 1
zpe: 992606.0 jmol-1
zpe.correction: 0.378064 hartree
zpe.thermalcorrener: 0.398800 hartree
zpe.thermalcorrenthalpy: 0.399744 hartree
zpe.thermalcorrgfe: 0.326341 hartree
zpe.sumelectzpe: -828.403207 hartree
zpe.sumelectthermal: -828.382471 hartree
zpe.sumelectthermalent: -828.381527 hartree
zpe.sumelectthermalfe: -828.454930 hartree
dipole: 0.8304 1.0046 -1.0567
dipole: 1.6779
quadrupole: -102.2074 -118.0943 -113.8375
quadrupole: 4.2293 1.7460 -3.2793
quadrupole: 9.1723 -6.7146 -2.4578 4.2293 1.7460 -3.2793
hfenergy: -828.781271 hartree
pointgroup: C01 [X(C16H25N1O2)]
dipole: -0.2297591 -0.3348351 -0.5204614 debye
polarizability: 219.0883074|30.9417257|165.4786131|7.5099137|8.0735669|171.6123033 unknown
InChI: InChI=1S/C16H25NO2/c1-5-13(2)15(14-9-7-6-8-10-14)16(18)19-12-11-17(3)4/h6-10,13,15H,5,11-12H2,1-4H3
charge 0 multiplicity 1
44 atoms
O  -1.325139 0.849215 -0.844152
O  -0.609419 -0.084553 1.166911
N  -4.841715 -0.306489 -0.045591
C  1.483759 -1.235693 -0.915875
C  0.997697 0.256543 -0.707533
C  1.829339 -1.974124 0.402775
C  2.062636 1.129676 -0.031092
C  0.459582 -2.014311 -1.776173
C  -0.351161 0.304013 0.001297
C  2.547892 -3.323163 0.174363
C  3.038084 1.74866 -0.855768
C  2.142051 1.317252 1.372938
C  -2.713413 0.93037 -0.298666
C  -3.486082 -0.359792 -0.63522
C  4.071911 2.531373 -0.296646
C  3.172445 2.106431 1.932785
C  4.142575 2.714005 1.103778
C  -5.859792 -1.026792 -0.835201
C  -4.869278 -0.691721 1.38136
H  2.425878 -1.141344 -1.498847
H  0.821571 0.664111 -1.720071
H  2.481766 -1.324328 1.015554
H  0.90547 -2.131417 0.990591
H  0.192146 -1.45316 -2.690854
H  -0.472567 -2.203209 -1.209765
H  0.866327 -2.992131 -2.087449
H  2.858049 -3.766867 1.138118
H  3.457791 -3.1905 -0.44223
H  1.899054 -4.059215 -0.334154
H  2.981929 1.621407 -1.944484
H  1.394148 0.849504 2.021684
H  -2.659072 1.096152 0.790471
H  -3.163992 1.800283 -0.798614
H  -2.900133 -1.243509 -0.282138
H  -3.575295 -0.442482 -1.73344
H  4.813958 3.002903 -0.950966
H  3.217048 2.244924 3.019096
H  4.940284 3.324762 1.541264
H  -6.858734 -0.848177 -0.397604
H  -5.870385 -0.645739 -1.871517
H  -5.697332 -2.133944 -0.872231
H  -4.123575 -0.112972 1.951912
H  -5.866068 -0.474277 1.804776
H  -4.650539 -1.777575 1.541706
