program: Gaussian 09
title: 000296224
version: EM64L-G09RevD.01
frameworkgroup: C1[X(C7H6BrN3)]
method: RPBEPBE
basis: SDD
operation: Freq
keyword: #p
keyword: freq=noraman
keyword: PBEPBE/SDD
title: #p freq=noraman PBEPBE/SDD
converged: NO NO NO NO
title: Mulliken charges:
elementType: Br N N N C C C C C C C H H H H H H
charge: 0.022504 -0.245848 -0.022820 -0.013624 0.522168 0.218535 -0.400265 -0.153190 -0.764363 -0.393533 -0.277588 0.252597 0.236870 0.236874 0.277950 0.257818 0.245912
chargesum: 0.00000
title: Mulliken charges with hydrogens summed into heavy atoms:
elementType: Br N N N C C C C C C C
charge: 0.022504 -0.245848 -0.022820 -0.013624 0.522168 0.218535 -0.400265 0.099407 -0.012668 -0.135715 -0.031676
polarizability: 1.55937372e+02 3.50361713e+00 1.27845611e+02 -1.18359464e-02 3.83425030e-03 4.55801023e+01
1716.lowfreq: -9.1829 -0.0005 -0.0005 0.0002 2.5238 7.2522 110.5117 119.6330 139.3782
frequency: 110.4787 119.6292 139.3766 145.1954 219.3532 223.5521 310.8908 322.7472 412.6602 517.2732 534.9457 591.7761 602.2935 656.7797 728.2346 733.5695 755.9465 788.7361 912.8964 923.7978 930.1400 971.0935 996.8763 1044.8236 1081.9772 1177.5246 1218.0799 1263.0130 1290.8732 1326.5951 1346.3223 1398.2649 1414.9356 1443.3568 1463.0606 1466.1132 1479.9129 1505.5509 1586.4557 2975.8458 3047.2819 3126.0517 3148.1796 3171.7420 3201.1101
redmass: 1.4352 2.1877 9.7940 3.6046 6.4349 3.2431 8.8292 5.5875 2.7164 4.9770 6.3551 5.0313 6.9299 7.4171 5.5453 5.5799 6.0662 1.3957 1.2906 1.4471 5.2341 2.6962 2.6625 1.4414 3.9401 1.6387 10.5319 2.4287 4.6553 1.6776 2.6489 1.2308 2.2288 5.3754 1.8775 1.0434 2.2421 5.4724 6.3518 1.0399 1.0982 1.0955 1.0918 1.0885 1.0996
irintensity: 1.6553 0.8053 0.3055 0.0003 6.8013 2.0028 1.9590 1.8835 8.4172 2.5577 1.0738 9.1662 3.1612 0.6785 1.1394 3.0162 5.8804 49.0152 5.6229 0.5476 41.1708 18.1072 22.4984 3.1439 6.2227 6.1529 54.5984 58.6216 14.5885 21.5060 52.4022 7.8788 4.2753 3.4469 16.1608 19.6939 19.5530 12.4460 42.8850 25.0839 17.4971 2.3221 3.6129 6.4700 8.9018
temp: 298.150 k
press: 1.00000 atm
elementType: 35 7 7 7 6 6 6 6 6 6 6 1 1 1 1 1 1
symmnumber: 1
zpe: 315965.5 jmol-1
zpe.correction: 0.120345 hartree
zpe.thermalcorrener: 0.129706 hartree
zpe.thermalcorrenthalpy: 0.130650 hartree
zpe.thermalcorrgfe: 0.084456 hartree
zpe.sumelectzpe: -447.258746 hartree
zpe.sumelectthermal: -447.249385 hartree
zpe.sumelectthermalent: -447.248441 hartree
zpe.sumelectthermalfe: -447.294635 hartree
dipole: -3.8541 1.5523 0.0003
dipole: 4.1549
quadrupole: -62.5074 -77.5122 -74.9485
quadrupole: -11.8830 -0.0021 0.0006
quadrupole: 9.1486 -5.8562 -3.2924 -11.8830 -0.0021 0.0006
hfenergy: -447.3790911 hartree
pointgroup: C01 [X(C7H6Br1N3)]
dipole: -0.6340667 1.5066879 0.0001283 debye
dipolederiv: -0.1913151 0.226603 0.0000239 0.3243452 -0.458334 -0.0000762 0.0000341 -0.0000503 0.0105444 -0.1985282 -0.0278919 -0.0000136 0.5798976 -0.3870981 -0.0000695 0.0001182 -0.0000266 0.0495463 -0.3580221 -0.0884888 0.0000005 -0.0220172 -0.5441736 -0.0000311 0.0000118 -0.0000053 -0.2098086 -0.5893536 0.1468895 0.0000303 -0.1002993 -0.3042498 0.0000155 0.0000231 -0.0000221 -0.2592268 -0.2446958 0.0156955 0.0000107 -0.4564804 -0.3431186 -0.0000231 -0.000068 -0.0000537 0.1257828 0.0644115 0.2183949 0.0000226 0.0694337 0.5257715 0.0000053 0.0000769 0.0000568 0.0039232 0.4323148 -0.5014176 -0.0000529 -0.5739376 1.0526727 0.0001776 -0.0001051 0.0001295 -0.1379685 0.0106136 0.0741272 0.0000131 -0.118121 0.0185616 0.0000286 -0.0000525 -0.0000041 -0.0985222 0.0263347 0.0256843 0.0000143 -0.0471752 -0.0836565 -0.0000019 -0.0000585 -0.0000528 0.0992 0.5304144 -0.0473709 -0.000024 0.1796305 0.2651212 0.0000353 -0.0000278 0.0000373 -0.0074155 0.2794417 -0.2136574 -0.0000567 0.0722135 0.1909756 0.0000297 0.0000249 0.0000694 -0.1056985 0.0889342 -0.0337867 0.0000002 0.0285012 -0.0346867 -0.000037 0.0000032 -0.0000204 0.1820861 0.0680562 0.0651131 -0.0960283 -0.0220712 -0.0220986 0.046034 -0.0545061 0.0966266 -0.0386743 0.0681232 0.0650645 0.0959914 -0.0221068 -0.022116 -0.0460356 0.0544795 -0.0966556 -0.038756 -0.0482673 -0.0695617 0.0000324 0.0179709 0.1193816 -0.0000011 0.000035 0.0000121 0.1342024 0.0937102 0.0417714 0.0000092 0.0209127 -0.0285335 -0.000027 0.0000114 -0.000024 0.1302692 -0.0321727 0.1028319 0.0000266 0.0693036 0.055581 -0.0000235 0. -0.0000169 0.160516 unknown
polarizability: 145.2779242|-14.0745932|138.5050587|-0.0056118|0.011104|45.5801023 unknown
InChI: InChI=1S/C7H6BrN3/c1-5-10-7(8)6-4-9-2-3-11(5)6/h2-4H,1H3
charge 0 multiplicity 1
17 atoms
Br 2.300437 -2.57544 -0.00037
N  -0.214428 0.698276 0.000127
N  2.010717 0.315581 0.000021
N  -2.459147 -1.035589 -0.000026
C  -0.039531 -0.730479 -0.000105
C  1.050192 1.282748 0.000035
C  1.361404 -0.895043 -0.000157
C  -1.505193 1.236411 0.000301
C  1.286627 2.75878 0.000093
C  -1.212433 -1.542131 -0.000171
C  -2.577565 0.361998 0.000211
H  -1.603035 2.323134 0.000453
H  0.854986 3.248819 -0.893771
H  0.855328 3.248684 0.894196
H  2.372281 2.935654 -0.000099
H  -1.109634 -2.632271 -0.000332
H  -3.598404 0.751265 0.000296
