program: Gaussian 09
title: 000296246
version: EM64L-G09RevD.01
frameworkgroup: C1[X(C10H13N5O4S)]
method: RPBEPBE
basis: SDD
operation: Freq
keyword: #p
keyword: freq=noraman
keyword: PBEPBE/SDD
title: #p freq=noraman PBEPBE/SDD
converged: YES YES NO NO
title: Mulliken charges:
elementType: S O O O O N N N N N C C C C C C C C C C H H H H H H H H H H H H H
charge: 0.314191 -0.245601 -0.441453 -0.443466 -0.434479 -0.125662 -0.097555 -0.043748 -0.004556 -0.001652 -0.191872 -0.170783 -0.110664 -0.103324 -0.376798 0.166965 0.064864 -0.309737 -0.348455 -0.817535 0.271560 0.276826 0.295922 0.262522 0.217505 0.253729 0.355252 0.364330 0.342451 0.256825 0.286495 0.288014 0.249887
chargesum: 0.00000
title: Mulliken charges with hydrogens summed into heavy atoms:
elementType: S O O O O N N N N N C C C C C C C C C C
charge: 0.314191 -0.245601 -0.086201 -0.079135 -0.092029 -0.125662 -0.097555 -0.043748 -0.004556 -0.001652 0.079688 0.106044 0.185258 0.159198 0.094436 0.166965 0.064864 -0.309737 -0.091630 0.006861
polarizability: 2.79615740e+02 -4.41411904e+00 1.66034791e+02 -6.82610288e+00 -1.02809528e+00 1.01977711e+02
1716.lowfreq: -2.2427 0.0011 0.0015 0.0023 7.5345 12.6016 28.2486 37.5791 54.0883
frequency: 27.9563 37.2503 54.0746 76.2198 84.6366 102.7952 109.1231 127.4084 144.9532 178.1812 180.1619 194.5624 217.5376 241.9127 250.2836 268.2020 301.0400 315.8286 316.4393 359.9802 374.1031 404.8359 418.3353 464.3408 526.8226 537.1371 547.0958 611.0399 628.4621 649.6496 655.8294 660.6612 693.4323 707.7607 746.1475 769.1093 802.4562 813.8159 834.2422 871.9911 919.0911 936.5610 944.4629 948.3763 956.3924 975.9346 980.3498 994.4462 1010.5299 1030.8067 1039.1464 1056.9446 1076.7356 1103.3770 1135.1347 1161.8123 1176.8849 1197.2483 1211.2197 1224.5402 1240.4266 1277.0106 1281.6996 1290.0313 1293.4501 1300.1911 1323.6940 1338.6428 1347.4376 1355.3923 1373.8193 1383.1306 1393.0250 1404.3894 1434.4394 1445.4768 1446.5618 1476.4257 1513.6768 1531.8197 2994.8178 3020.1160 3030.3613 3030.5216 3065.3356 3073.6694 3106.3725 3157.2740 3163.6760 3177.6054 3254.7991 3562.7174 3575.4619
redmass: 6.1476 7.0166 6.0481 4.7728 4.0469 1.3158 3.2963 5.6272 4.2477 7.9881 4.7495 5.8132 5.0655 6.1908 4.9160 5.9693 3.8629 1.2633 1.6941 2.1980 5.5104 11.6074 5.0566 6.3771 4.6197 8.1329 5.5097 10.9968 8.2868 8.4940 8.1758 6.2365 1.8083 2.2149 6.3451 5.0252 11.3086 10.6102 2.6369 3.9254 4.5144 1.4536 7.3607 3.5161 3.9530 3.5363 1.1804 1.3641 3.5809 5.1556 5.3462 1.9247 1.6730 6.5474 3.9331 1.4664 1.4608 5.4006 1.8495 5.0160 1.3434 1.1769 1.8618 1.2275 2.2688 8.9009 1.3496 1.3409 1.1432 1.4419 1.2136 2.2335 1.4464 3.0131 1.0519 1.1516 1.0596 1.0768 9.7426 11.5366 1.0668 1.0863 1.0283 1.0871 1.0862 1.0881 1.0993 1.1046 1.1056 1.0928 1.0686 1.0664 1.0664
irintensity: 0.5007 0.4462 3.2976 3.1433 1.5942 0.6720 0.9691 1.4433 9.7751 1.6223 1.6131 5.8555 2.3262 1.6157 6.6814 1.4132 37.7083 102.5286 178.7586 40.3379 6.5228 4.7258 15.0344 7.7496 24.4643 13.3914 4.3653 1.4671 2.6450 11.2228 0.3816 23.5810 73.3388 29.1000 77.4763 32.2228 1.6089 19.0453 16.5526 47.0450 160.6500 10.2906 25.8655 82.9851 182.1443 61.4945 6.0595 9.6912 106.7247 14.8273 69.7832 27.2317 17.3837 36.6679 67.5873 24.8608 17.0216 10.0074 64.7117 0.8707 2.1332 14.8440 6.2705 19.1454 39.8812 171.6579 12.3210 3.6419 2.4595 10.7120 5.2445 1.9254 6.9618 65.7627 15.6511 75.5882 26.6289 9.4410 205.8817 127.5754 46.1660 35.0096 16.2642 15.8970 25.0982 5.6304 12.0057 5.9488 7.1008 10.1943 669.5716 10.5050 15.4326
temp: 298.150 k
press: 1.00000 atm
elementType: 16 8 8 8 8 7 7 7 7 7 6 6 6 6 6 6 6 6 6 6 1 1 1 1 1 1 1 1 1 1 1 1 1
symmnumber: 1
zpe: 634315.5 jmol-1
zpe.correction: 0.241598 hartree
zpe.thermalcorrener: 0.260611 hartree
zpe.thermalcorrenthalpy: 0.261555 hartree
zpe.thermalcorrgfe: 0.193219 hartree
zpe.sumelectzpe: -1360.000243 hartree
zpe.sumelectthermal: -1359.981230 hartree
zpe.sumelectthermalent: -1359.980285 hartree
zpe.sumelectthermalfe: -1360.048622 hartree
dipole: 2.8329 1.5969 0.0160
dipole: 3.2521
quadrupole: -106.0023 -137.5444 -116.9265
quadrupole: 3.0401 0.2718 5.3550
quadrupole: 14.1554 -17.3867 3.2313 3.0401 0.2718 5.3550
hfenergy: -1360.2418408 hartree
pointgroup: C01 [X(C10H13N5O4S1)]
dipole: -1.1604659 0.2872887 0.4558403 debye
polarizability: 277.802584|16.5516282|122.9931383|4.7783433|30.2596021|146.832519 unknown
InChI: InChI=1S/C10H13N5O4S/c1-20-9-5-8(11-3-12-9)15(14-13-5)10-7(18)6(17)4(2-16)19-10/h3-4,6-7,10,16-18H,2H2,1H3
charge 0 multiplicity 1
33 atoms
S  -4.613651 -1.1734 -1.292879
O  2.018862 -0.490579 1.129175
O  2.99587 2.338375 0.319819
O  2.663124 -0.516704 -2.106586
O  5.732042 -0.734481 0.522469
N  0.036437 0.238916 -0.017515
N  -0.003774 -0.517444 -1.219495
N  -1.273776 -0.852973 -1.483772
N  -1.669022 1.011472 1.605056
N  -3.92185 0.293494 0.930651
C  2.267866 1.322865 -0.450004
C  3.182844 0.150672 -0.923753
C  1.319506 0.66563 0.581771
C  3.257366 -0.765195 0.322217
C  4.469266 -0.493546 1.236065
C  -1.242315 0.366125 0.481194
C  -2.0693 -0.325187 -0.457827
C  -3.46918 -0.339644 -0.186118
C  -3.019366 0.92575 1.755763
C  -6.239145 -0.83105 -0.405605
H  1.727818 1.768836 -1.306973
H  4.189537 0.502054 -1.205092
H  1.062051 1.358418 1.400553
H  3.21632 -1.825769 0.011243
H  4.388795 -1.11122 2.152461
H  4.492658 0.569106 1.522483
H  3.69765 2.738511 -0.252851
H  1.683979 -0.712411 -1.975285
H  5.817155 -1.700261 0.319442
H  -3.443733 1.417522 2.635362
H  -6.411044 0.252489 -0.354363
H  -6.201789 -1.252068 0.60802
H  -7.008603 -1.328103 -1.01562
