program: Gaussian 09
title: 000296290
version: EM64L-G09RevD.01
frameworkgroup: C1[X(C14H15N3O5S)]
method: RPBEPBE
basis: SDD
operation: Freq
keyword: #p
keyword: freq=noraman
keyword: PBEPBE/SDD
title: #p freq=noraman PBEPBE/SDD
converged: YES YES NO NO
title: Mulliken charges:
elementType: S O O O O O N N N C C C C C C C C C C C C C C H H H H H H H H H H H H H H H
charge: 0.971613 -0.527443 -0.491749 -0.254099 -0.211220 -0.210221 -0.648417 -0.129540 -0.045883 0.000425 -0.244693 -0.245621 0.316208 -0.340433 -0.333158 0.373240 0.136096 -0.450894 0.221380 -0.000800 -0.785882 -0.507797 -0.507212 0.290301 0.286061 0.349498 0.256819 0.292143 0.258737 0.240490 0.242870 0.267944 0.231612 0.245258 0.244260 0.240363 0.237850 0.231893
chargesum: 0.00000
title: Mulliken charges with hydrogens summed into heavy atoms:
elementType: S O O O O O N N N C C C C C C C C C C C C C C
charge: 0.971613 -0.527443 -0.491749 -0.254099 -0.211220 -0.210221 -0.298920 -0.129540 -0.045883 0.000425 0.045608 0.040441 0.316208 -0.083614 -0.041015 0.373240 0.136096 -0.192157 0.221380 -0.000800 -0.034579 0.213334 0.202894
polarizability: 2.97991399e+02 -1.10013414e+01 2.15788225e+02 5.89869052e+00 -2.14785124e+01 1.75287851e+02
1716.lowfreq: -7.9475 -6.7524 -2.8597 -0.0014 -0.0008 -0.0007 11.2600 17.2164 29.9620
frequency: 11.0583 17.1314 29.9115 58.1251 61.5374 76.9626 94.5401 107.9681 114.4365 121.7436 140.4665 155.3229 169.7069 182.9890 188.1442 194.6983 204.6646 211.8066 222.1451 239.8759 247.1719 265.4224 278.8315 345.6095 363.9704 377.5505 405.0041 428.3632 442.7994 455.4704 485.7151 488.8759 494.8320 566.6814 587.0949 589.9643 615.1975 615.7774 634.2604 656.8781 671.2520 724.5027 730.0555 739.7962 756.2826 810.8351 823.7998 848.5274 856.6726 881.4164 917.0989 946.5228 948.4967 953.9648 978.2957 992.3740 999.5906 1019.1344 1029.4351 1049.2073 1068.5732 1069.5075 1113.5811 1113.9034 1124.6767 1150.9388 1159.0715 1164.2278 1180.5103 1263.3258 1264.6768 1294.0248 1316.1506 1340.1350 1370.3999 1374.2382 1389.5369 1390.9053 1403.3228 1444.1076 1447.2481 1449.8350 1453.5384 1460.8142 1462.0279 1465.1391 1466.1793 1470.5712 1525.3626 1543.7036 1578.5368 1588.5317 1613.5785 2985.9308 2994.2139 3007.8890 3069.5700 3094.8272 3112.7432 3128.8285 3139.1331 3147.9282 3153.9812 3156.0808 3172.3687 3176.3371 3197.5037 3489.1378
redmass: 6.1392 4.7515 4.2895 6.5770 5.2452 5.0324 4.1179 3.4400 4.6609 4.6472 1.2915 1.0389 3.6744 4.8141 1.7482 5.4406 5.8797 3.5977 4.7567 4.3945 6.9179 7.2290 4.3459 6.7957 6.6240 6.7220 2.8383 5.1608 4.9741 3.0581 4.5525 2.0517 6.0106 6.5287 3.9677 2.6401 5.5722 6.1780 5.6621 8.3021 3.9451 4.4072 3.4677 4.4281 4.3610 12.7382 1.9439 1.3091 1.3813 7.9607 9.8313 3.5287 4.6908 7.3748 1.3514 5.3170 1.3855 3.1903 1.8404 2.7729 4.3583 2.3085 1.2528 1.3307 1.2486 1.3979 1.5771 1.6608 1.1352 3.2407 2.4453 1.2558 7.0724 3.0505 1.3198 2.4135 2.7535 8.9454 2.8229 1.3413 1.1034 1.0510 1.0570 1.5569 1.0514 1.2615 2.0847 1.0865 7.4452 6.2769 7.1644 6.3151 8.1481 1.0380 1.0296 1.0289 1.0968 1.1044 1.1047 1.0989 1.1040 1.1055 1.0887 1.0884 1.0967 1.0968 1.0941 1.0778
irintensity: 0.4728 0.3339 1.4246 1.5954 3.8180 1.0857 2.2763 9.0517 3.1331 3.2567 1.0025 0.4097 4.1495 3.1918 5.0950 6.3207 2.2048 2.5819 2.2592 3.5868 6.3494 17.9590 3.8826 4.4896 39.0463 29.4901 0.2116 14.9476 75.9718 10.5233 15.4409 44.9039 53.1846 7.0687 26.1762 16.7964 110.2253 35.6263 17.3122 11.9839 11.4539 36.0425 12.5647 67.6447 4.7236 110.1684 78.0355 20.4028 33.6372 5.6611 2.3578 50.8905 3.8392 43.7415 0.5724 5.9674 2.1296 99.7922 0.4126 25.4929 91.6836 0.3922 0.3198 5.8377 0.4540 37.0125 153.5002 43.6491 4.9195 299.9262 106.5589 1.2233 55.7992 321.2150 35.7058 48.9257 61.4454 6.0081 25.2677 29.9484 29.4226 14.7129 12.2161 32.1241 25.1896 23.3233 1.5711 34.7190 292.9284 884.9935 87.7788 7.4999 58.8658 2.9534 37.6499 47.1457 9.9022 25.5561 23.6967 15.1777 26.4604 24.5192 4.0602 3.0360 1.2238 2.5428 0.2097 51.7213
temp: 298.150 k
press: 1.00000 atm
elementType: 16 8 8 8 8 8 7 7 7 6 6 6 6 6 6 6 6 6 6 6 6 6 6 1 1 1 1 1 1 1 1 1 1 1 1 1 1 1
symmnumber: 1
zpe: 724777.4 jmol-1
zpe.correction: 0.276053 hartree
zpe.thermalcorrener: 0.299596 hartree
zpe.thermalcorrenthalpy: 0.300540 hartree
zpe.thermalcorrgfe: 0.220337 hartree
zpe.sumelectzpe: -1479.044181 hartree
zpe.sumelectthermal: -1479.020638 hartree
zpe.sumelectthermalent: -1479.019694 hartree
zpe.sumelectthermalfe: -1479.099897 hartree
dipole: -0.0531 -3.3517 0.0541
dipole: 3.3525
quadrupole: -135.1729 -150.0563 -145.0872
quadrupole: -8.4732 19.4022 -14.3066
quadrupole: 8.2659 -6.6175 -1.6484 -8.4732 19.4022 -14.3066
hfenergy: -1479.3202341 hartree
pointgroup: C01 [X(C14H15N3O5S1)]
dipole: 0.0329233 -1.0568356 -0.7884913 debye
polarizability: 271.0242989|-29.4241848|187.8585182|41.7369566|13.7492028|230.1846572 unknown
InChI: InChI=1S/C14H15N3O5S/c1-9(18)10-4-6-11(7-5-10)23(19,20)17-12-8-13(21-2)16-14(15-12)22-3/h4-8,17H,1-3H3
charge 0 multiplicity 1
38 atoms
S  0.101593 2.265051 0.946311
O  -0.481118 3.226858 2.12242
O  1.102665 2.839312 -0.190085
O  4.264915 -2.411617 2.659718
O  2.423808 -1.735624 -1.561081
O  -5.732081 -0.699376 -1.133245
N  0.855263 0.928459 2.001017
N  1.618183 -0.385782 0.195126
N  3.32686 -2.092349 0.517715
C  -1.34232 1.400124 0.094515
C  -1.250394 1.188525 -1.287309
C  -2.468419 1.081851 0.871427
C  -3.518047 0.242713 -1.18884
C  -2.361653 0.602655 -1.93093
C  -3.561744 0.48836 0.211305
C  1.728515 -0.048603 1.522408
C  -4.727097 -0.392714 -1.83594
C  2.632008 -0.69318 2.398138
C  3.397862 -1.741096 1.826336
C  2.443839 -1.375512 -0.2315
C  -4.71023 -0.653266 -3.336006
C  5.087813 -3.483252 2.049141
C  1.526001 -0.968198 -2.446525
H  -0.348786 1.488699 -1.828739
H  -2.492977 1.30264 1.942724
H  0.981943 1.306528 2.949207
H  -2.321144 0.433247 -3.011355
H  -4.469202 0.209038 0.75611
H  2.745303 -0.426485 3.449371
H  -3.876246 -1.324002 -3.615221
H  -4.58294 0.288542 -3.902015
H  -5.66119 -1.121902 -3.629601
H  5.697299 -3.860621 2.882516
H  5.717615 -3.072523 1.243026
H  4.442035 -4.273753 1.6328
H  1.775626 0.106416 -2.411135
H  0.473974 -1.108479 -2.144025
H  1.710469 -1.386386 -3.446579
