program: Gaussian 09
title: 000296317
version: EM64L-G09RevD.01
frameworkgroup: C1[X(C20H28N2O2S)]
method: RPBEPBE
basis: SDD
operation: Freq
keyword: #p
keyword: freq=noraman
keyword: PBEPBE/SDD
title: #p freq=noraman PBEPBE/SDD
converged: YES YES NO NO
title: Mulliken charges:
elementType: S O O N N C C C C C C C C C C C C C C C C C C C C H H H H H H H H H H H H H H H H H H H H H H H H H H H H
charge: 0.258611 -0.343423 -0.431787 -0.379454 -0.103637 -0.481138 -0.424941 -0.406926 0.366559 -0.463431 -0.382818 0.269443 0.064619 -0.498338 0.306067 0.429053 -0.443677 -0.362894 -0.408708 -0.448429 -0.326322 -0.323705 -0.495532 -0.673688 -0.672331 0.252739 0.232805 0.213355 0.204419 0.212412 0.213882 0.240068 0.239640 0.224208 0.226186 0.208417 0.229083 0.362788 0.240882 0.233017 0.190963 0.204419 0.191631 0.206301 0.223209 0.205649 0.208540 0.227612 0.206901 0.207886 0.226824 0.207651 0.335341
chargesum: 0.00000
title: Mulliken charges with hydrogens summed into heavy atoms:
elementType: S O O N N C C C C C C C C C C C C C C C C C C C C
charge: 0.258611 -0.343423 -0.096447 -0.016666 -0.103637 0.004406 -0.007166 0.019368 0.366559 0.016277 -0.382818 0.269443 0.064619 -0.498338 0.306067 0.429053 0.006718 0.074606 -0.167826 -0.215412 0.069061 0.074227 -0.066673 -0.030636 -0.029970
polarizability: 3.71765402e+02 -9.16271339e-01 2.98313975e+02 1.78241034e+01 7.65709212e+00 1.60015446e+02
1716.lowfreq: -11.2593 -6.8495 0.0008 0.0012 0.0015 4.2412 11.7825 18.5976 22.2280
frequency: 10.4350 18.5383 21.9986 46.7185 55.0444 57.8481 69.3819 71.0056 82.3278 99.0192 109.1097 124.8569 147.1660 164.8725 191.7386 202.3794 220.9759 229.8599 241.2179 269.9968 280.8838 288.1071 290.9855 304.1101 319.5575 330.3929 348.2281 372.1108 394.2908 398.4966 412.5178 419.6601 443.1746 454.6319 474.2852 480.4333 487.5464 513.9528 524.6660 560.7569 579.2224 606.7867 612.5872 696.0610 713.9410 747.8039 764.0456 772.4082 785.4976 794.3520 801.8275 810.2587 820.3834 839.9712 844.6710 874.8495 889.2606 897.3423 912.2204 915.6568 943.7193 949.8388 967.0471 987.3521 995.9390 1000.2935 1022.8568 1058.9394 1071.9928 1075.9503 1078.3933 1083.0703 1084.2051 1094.8715 1111.2647 1121.4878 1132.2532 1147.7391 1155.2743 1170.3486 1178.5019 1183.9093 1207.0181 1239.0737 1243.1830 1246.1556 1261.9259 1278.2467 1281.3120 1288.5897 1292.1754 1296.9100 1313.2258 1320.8310 1330.2250 1340.6360 1349.3640 1352.6779 1360.0108 1362.2021 1364.2988 1373.4995 1376.2537 1381.8877 1386.4728 1387.2099 1403.9433 1446.2643 1453.4698 1461.6828 1462.7327 1468.7435 1470.2443 1470.2724 1474.1275 1475.9028 1479.6946 1485.7043 1486.3260 1489.6207 1491.6929 1537.8475 1583.8925 1608.2302 1628.7522 2854.9439 2863.2466 2896.1001 2966.9402 2967.5719 2980.2110 2980.4982 2982.1160 2983.0399 2988.2053 2998.8579 3019.5534 3021.9485 3033.7068 3038.3864 3043.3053 3048.1649 3050.8615 3056.7453 3063.5629 3072.6396 3075.6488 3090.3385 3091.2400 3116.6089 3126.9992 3167.7376 3551.8298
redmass: 3.3976 4.3831 4.1561 4.8718 4.2257 3.0389 3.9025 3.1855 2.0214 4.3595 2.7417 4.5104 2.1510 2.2743 4.4448 1.6962 1.9024 3.7477 1.6920 2.3246 2.6156 2.2793 2.2014 2.2219 2.9359 2.2921 2.2632 5.9402 3.3337 4.1490 6.3683 5.0533 3.0783 2.8791 4.4140 4.3398 3.7390 3.4345 4.5443 4.6649 3.9545 3.9087 3.6176 4.7783 4.8290 2.5512 3.4109 3.8899 1.3124 1.1368 1.2930 1.7091 1.6597 3.5722 4.0545 2.8076 1.1094 1.5295 3.2388 2.0169 1.5984 2.5216 2.2367 2.3457 2.7861 3.4623 3.8817 1.9381 2.7455 1.8935 3.4595 1.9524 2.1434 2.6011 1.8220 1.8349 1.1495 1.4845 1.4722 1.4952 1.9905 1.4895 2.2664 1.4151 1.6836 1.6502 1.3472 1.2342 1.4769 1.2225 1.2098 1.4869 1.6950 1.6440 1.3976 1.5022 2.0383 1.8154 1.3688 2.1712 1.3770 1.3863 1.5842 3.6741 1.2335 1.2359 3.6315 1.1212 1.0804 1.0588 1.0566 1.1682 1.0822 1.0621 1.0935 1.1580 1.1437 1.2636 1.4291 1.1568 1.3080 3.2062 2.6266 5.0351 6.6628 1.0718 1.0714 1.0706 1.0620 1.0657 1.0688 1.0358 1.0620 1.0357 1.0628 1.0607 1.0879 1.0958 1.0874 1.0903 1.0938 1.0982 1.0975 1.1032 1.1026 1.0981 1.0983 1.1004 1.1004 1.0893 1.0835 1.0935 1.0662
irintensity: 0.0398 0.3302 0.0107 0.7895 2.8265 0.7727 1.0616 0.1977 0.1689 0.9180 1.4660 0.6280 1.2477 2.3575 0.4946 1.4296 5.1752 3.8119 3.7335 2.5664 17.6532 1.4436 4.3893 8.4032 21.3319 41.7052 85.9144 13.7086 8.0412 2.0515 2.6890 26.1263 1.4973 5.6367 9.5919 13.1121 9.3832 8.0273 5.6609 4.3570 5.5746 9.6090 13.9183 5.9000 5.2498 7.6848 17.0188 5.2163 4.8148 4.4727 6.2758 51.3662 8.0974 22.4794 4.6028 6.7506 79.3743 7.8070 47.9714 13.0164 11.0302 13.8300 8.5847 2.5745 22.8980 8.7736 9.1706 17.3737 53.7141 27.0736 11.9307 3.8483 3.0835 9.2013 0.4605 10.0510 1.7885 11.2417 9.7888 2.2114 12.5601 15.8406 39.8646 34.4539 15.7825 2.5617 13.9782 55.1049 55.8098 48.6785 30.8136 18.3778 23.6352 8.4673 4.5774 9.1402 38.9125 18.1357 2.3083 81.7638 14.3349 40.1370 19.9947 3.2510 27.2047 15.5892 63.7570 4.4730 12.1337 1.1626 7.4082 38.9022 12.2173 4.1313 12.9548 35.2259 55.2346 26.1314 78.1994 32.9290 63.9348 73.4242 185.1277 266.1051 175.4811 33.9249 154.1578 82.4699 17.7026 75.3651 24.1337 28.6247 28.5382 37.1436 37.1885 69.2863 18.6743 22.6564 17.4524 7.2939 48.1696 31.7596 15.6300 58.1748 37.5000 77.9747 69.5211 29.6235 52.8855 27.3051 211.7968 22.6333 5.2455
temp: 298.150 k
press: 1.00000 atm
elementType: 16 8 8 7 7 6 6 6 6 6 6 6 6 6 6 6 6 6 6 6 6 6 6 6 6 1 1 1 1 1 1 1 1 1 1 1 1 1 1 1 1 1 1 1 1 1 1 1 1 1 1 1 1
symmnumber: 1
zpe: 1166186.8 jmol-1
zpe.correction: 0.444177 hartree
zpe.thermalcorrener: 0.470135 hartree
zpe.thermalcorrenthalpy: 0.471079 hartree
zpe.thermalcorrgfe: 0.385178 hartree
zpe.sumelectzpe: -1435.034743 hartree
zpe.sumelectthermal: -1435.008784 hartree
zpe.sumelectthermalent: -1435.007840 hartree
zpe.sumelectthermalfe: -1435.093741 hartree
dipole: -1.5574 -0.7056 1.0755
dipole: 2.0199
quadrupole: -140.7755 -158.6634 -157.4390
quadrupole: -13.0360 0.0247 -1.4416
quadrupole: 11.5172 -6.3708 -5.1464 -13.0360 0.0247 -1.4416
hfenergy: -1435.4789197 hartree
pointgroup: C01 [X(C20H28N2O2S1)]
dipole: -0.6393521 -0.4403573 0.1699168 debye
polarizability: 369.8577713|-18.9544584|243.5121812|18.5930363|67.4071781|216.7248703 unknown
InChI: InChI=1S/C20H28N2O2S/c1-3-22(4-2)12-11-21-16-10-9-14(13-23)20-18(16)19(24)15-7-5-6-8-17(15)25-20/h9-10,21,23H,3-8,11-13H2,1-2H3
charge 0 multiplicity 1
53 atoms
S  3.483211 0.581115 0.987761
O  0.529199 -1.595869 -1.655225
O  3.102058 3.56696 2.012051
N  -1.431139 -0.13567 -0.910199
N  -5.147629 -0.357717 -0.071744
C  3.006513 -2.700102 -1.631498
C  4.357147 -3.374224 -1.314799
C  5.47576 -2.320458 -1.179302
C  2.718844 -1.473482 -0.770178
C  5.160437 -1.368979 -0.003423
C  3.718588 -0.885736 -0.033707
C  0.842113 0.149364 -0.00582
C  1.329193 -0.973601 -0.834786
C  1.689491 0.890253 0.879546
C  -0.578308 0.521785 -0.054712
C  1.21185 1.934806 1.719296
C  -2.871723 0.109006 -1.011937
C  -3.694844 -0.590325 0.106746
C  -1.045602 1.573755 0.792058
C  -0.168467 2.24617 1.648841
C  -5.885205 -0.175751 1.206629
C  -5.780021 -1.349281 -0.98385
C  2.103083 2.694454 2.678547
C  -5.630456 1.201065 1.849526
C  -7.037933 -0.807554 -1.689862
H  2.168138 -3.410237 -1.515961
H  2.970156 -2.390907 -2.695588
H  4.603328 -4.102666 -2.109701
H  4.280184 -3.944477 -0.367179
H  6.457277 -2.801286 -1.010818
H  5.55121 -1.739132 -2.118973
H  5.337433 -1.892872 0.958765
H  5.845502 -0.498894 -0.010338
H  -3.101145 1.190997 -0.996175
H  -3.204249 -0.268286 -1.996013
H  -3.437253 -1.676509 0.117257
H  -3.376836 -0.185287 1.083967
H  -0.959223 -0.880552 -1.470462
H  -2.100791 1.857625 0.771355
H  -0.558184 3.04344 2.294582
H  -5.642508 -0.98686 1.939053
H  -6.964797 -0.265369 0.987995
H  -6.027497 -2.29804 -0.443037
H  -5.03447 -1.619251 -1.755402
H  2.731547 2.016973 3.283577
H  1.471373 3.292931 3.366448
H  -6.211137 1.306219 2.785003
H  -5.927768 2.004538 1.153347
H  -4.563611 1.344713 2.102358
H  -7.831554 -0.536961 -0.970061
H  -6.786908 0.095256 -2.273416
H  -7.45479 -1.569706 -2.374638
H  2.629614 4.119214 1.337596
