program: Gaussian 09
title: 000296214
version: EM64L-G09RevD.01
frameworkgroup: C1[X(C11H14O2)]
method: RPBEPBE
basis: SDD
operation: Freq
keyword: #pfreq=noraman
keyword: PBEPBE/SDD
title: #p freq=noraman PBEPBE/SDD
converged: YES YES NO NO
title: Mulliken charges:
elementType: O O C C C C C C C C C C C H H H H H H H H H H H H H H
charge: -0.224021 -0.226643 -0.148650 -0.450056 -0.468523 -0.447541 -0.290324 0.171225 -0.203570 -0.548555 -0.186405 -0.298225 0.129607 0.299669 0.205833 0.226103 0.224584 0.203718 0.211159 0.227637 0.238814 0.201788 0.244195 0.245947 0.204160 0.226790 0.231282
chargesum: 0.00000
title: Mulliken charges with hydrogens summed into heavy atoms:
elementType: O O C C C C C C C C C C C
charge: -0.224021 -0.226643 0.151019 -0.018120 -0.040221 -0.008745 -0.051509 0.171225 -0.001782 -0.058413 0.017756 0.159847 0.129607
polarizability: 1.66309366e+02 7.26476411e+00 1.08599258e+02 5.63484428e-01 3.79453056e+00 9.09215458e+01
1716.lowfreq: -24.0057 -8.9470 -2.5703 -0.0001 0.0004 0.0005 14.4798 54.9791 71.9228
frequency: 9.3860 54.7112 71.8596 114.8905 153.6507 172.3384 188.3262 266.9909 323.6265 357.7065 386.6530 401.5325 456.0350 497.4808 524.3901 635.3696 650.4629 657.5938 719.0176 724.8213 746.9553 812.6679 838.4519 866.3891 892.5289 914.0968 927.4612 933.1787 956.5241 973.7618 989.7122 1006.6339 1055.3856 1055.9753 1065.7838 1074.1881 1116.7254 1138.8652 1151.7706 1168.2689 1188.6429 1192.6592 1222.1240 1247.7377 1275.9495 1286.0090 1299.5164 1328.5846 1334.3494 1336.2262 1341.5781 1366.3543 1378.7466 1452.6059 1456.7850 1459.1054 1465.4163 1487.7737 1664.4296 1677.4976 1678.5806 2936.2006 2961.5252 2974.9981 2997.3889 3003.0965 3010.8865 3022.0581 3031.9504 3049.5352 3060.9471 3071.9912 3093.3580 3109.7184 3125.7270
redmass: 3.6354 4.4379 4.1931 2.7953 2.4749 3.0867 2.4561 4.6658 3.8338 3.1339 2.0911 2.4143 3.7499 4.3081 4.6545 4.5513 3.2036 1.4441 4.2845 4.5057 2.5861 2.0894 1.7122 2.2268 1.8407 2.2786 3.0594 2.0389 2.1588 1.2067 3.6317 5.1287 1.9959 1.8347 1.7056 2.6581 3.2309 1.1655 1.9599 1.1375 1.1627 1.3099 1.4114 1.2990 1.3527 1.3057 1.3223 1.3822 1.3890 1.3314 1.4727 1.5848 1.5664 1.0957 1.0762 1.0878 1.0901 1.0872 10.4379 6.5133 9.6592 1.0661 1.0613 1.0651 1.0642 1.0910 1.0958 1.0637 1.0864 1.0963 1.0926 1.0978 1.0838 1.1063 1.0994
irintensity: 1.9134 2.4209 2.1555 0.5087 5.5626 3.6457 1.5781 1.9880 0.3517 0.0877 0.3366 0.5491 3.4516 0.2654 4.3500 6.8019 2.1808 38.8285 3.5898 14.9009 7.6686 1.8406 8.2634 5.6488 8.8069 52.6122 9.7801 43.0539 16.9982 0.6415 100.2602 136.9708 16.3807 1.9861 5.4526 5.9041 16.7232 2.8826 64.1555 0.4962 3.1302 31.5749 15.2423 6.4810 16.7696 7.5608 0.9943 1.2220 7.8230 0.0958 3.7904 6.4512 0.2856 1.3163 18.9194 9.1281 7.3676 3.4833 144.5271 2.5013 119.1034 39.1621 35.7096 22.6289 18.8459 26.0374 38.5809 57.3783 13.4674 16.7520 31.0427 21.4766 8.5983 29.3170 72.7672
temp: 298.150 k
press: 1.00000 atm
elementType: 8 8 6 6 6 6 6 6 6 6 6 6 6 1 1 1 1 1 1 1 1 1 1 1 1 1 1
symmnumber: 1
zpe: 590011.5 jmol-1
zpe.correction: 0.224724 hartree
zpe.thermalcorrener: 0.236817 hartree
zpe.thermalcorrenthalpy: 0.237761 hartree
zpe.thermalcorrgfe: 0.184244 hartree
zpe.sumelectzpe: -577.007700 hartree
zpe.sumelectthermal: -576.995607 hartree
zpe.sumelectthermalent: -576.994662 hartree
zpe.sumelectthermalfe: -577.048180 hartree
dipole: -0.3600 -4.6617 1.8221
dipole: 5.0181
quadrupole: -69.4604 -81.7928 -76.5131
quadrupole: 11.6321 -3.2693 3.7347
quadrupole: 6.4617 -5.8707 -0.5910 11.6321 -3.2693 3.7347
hfenergy: -577.2324237 hartree
pointgroup: C01 [X(C11H14O2)]
dipole: -0.1451392 1.7101653 -0.9756804 debye
polarizability: 165.8092623|-8.5945256|109.7129296|-2.9500636|1.4160499|90.3079781 unknown
InChI: InChI=1S/C11H14O2/c12-11-10(6-7-13-11)8-9-4-2-1-3-5-9/h1-2,8-9H,3-7H2
charge 0 multiplicity 1
27 atoms
O  -3.350113 -0.760665 0.782572
O  -1.238252 -1.70551 1.000215
C  0.98909 0.226828 -0.007606
C  1.692215 -0.439288 -1.232807
C  1.945766 1.268001 0.640867
C  2.961963 -1.199979 -0.783766
C  -0.299166 0.886015 -0.438182
C  -1.572998 0.46153 -0.198163
C  3.360017 0.737048 0.794675
C  -2.861496 1.131638 -0.656295
C  3.813793 -0.379659 0.167947
C  -3.921962 0.533567 0.303452
C  -1.941269 -0.767059 0.576019
H  0.769945 -0.57335 0.721631
H  1.967679 0.345096 -1.966873
H  0.991017 -1.131793 -1.733563
H  1.54909 1.564835 1.632274
H  1.962149 2.199046 0.031409
H  3.561608 -1.483421 -1.672023
H  2.674286 -2.154135 -0.294513
H  -0.176129 1.811643 -1.026771
H  4.030785 1.297288 1.461006
H  -2.823169 2.232219 -0.598159
H  -3.090258 0.853677 -1.70264
H  4.842098 -0.722883 0.347767
H  -4.090397 1.170283 1.190199
H  -4.883588 0.299727 -0.17767
