program: Gaussian 09
title: 000296258
version: EM64L-G09RevD.01
frameworkgroup: C1[X(C14H26NO3P)]
method: RPBEPBE
basis: SDD
operation: Freq
keyword: #p
keyword: freq=noraman
keyword: PBEPBE/SDD
title: #p freq=noraman PBEPBE/SDD
converged: YES YES NO NO
title: Mulliken charges:
elementType: P O O O N C C C C C C C C C C C C C C H H H H H H H H H H H H H H H H H H H H H H H H H H
charge: 1.395474 -0.506856 -0.528004 -0.634802 -0.897034 0.486622 -0.085447 -0.093823 -0.085069 -0.504526 -0.514848 -0.576851 -0.451951 -0.451631 -0.449237 -0.243218 -0.249056 -0.653428 -0.653147 0.198824 0.196427 0.198809 0.255390 0.197094 0.211492 0.222763 0.200537 0.220676 0.202236 0.193755 0.193009 0.197275 0.194064 0.197464 0.355887 0.246896 0.207085 0.224197 0.224926 0.206078 0.228957 0.234734 0.205896 0.249486 0.232876
chargesum: 0.00000
title: Mulliken charges with hydrogens summed into heavy atoms:
elementType: P O O O N C C C C C C C C C C C C C C
charge: 1.395474 -0.506856 -0.528004 -0.634802 -0.541146 0.486622 0.113377 0.102604 0.113739 -0.052042 -0.080593 -0.155638 -0.055960 -0.061347 -0.057709 0.210762 0.200067 0.016341 0.035110
polarizability: 2.15609907e+02 -5.66474107e-01 1.75148658e+02 -6.63240089e-01 2.42481746e+00 1.55165946e+02
1716.lowfreq: -20.0229 -11.5818 -8.8946 -0.0007 0.0010 0.0017 10.0478 10.8720 24.8022
frequency: -17.4582 4.7841 24.4761 34.4050 43.5100 53.4120 99.4127 128.0858 155.0487 177.0747 200.6309 204.9015 231.4818 247.9073 275.7375 302.6973 306.5257 325.7738 349.8793 362.1452 386.6651 391.8867 394.3218 406.6894 418.1024 437.3358 442.2772 449.9973 487.1124 578.9566 615.5682 638.2362 640.7385 658.0944 706.0506 765.0749 801.8105 803.2460 806.8472 809.2399 839.9287 868.1887 872.8376 877.2021 879.8169 887.1293 936.1542 945.3316 949.7352 975.2627 979.5174 986.9191 1015.5879 1025.6722 1037.3151 1045.5347 1048.1355 1050.5961 1092.4882 1094.1737 1095.1837 1101.8257 1105.4805 1107.7506 1112.4075 1129.9693 1144.6272 1145.1593 1184.4175 1187.8524 1258.4212 1262.1140 1265.2308 1271.0649 1284.4057 1285.3720 1289.9874 1295.8034 1310.2288 1311.5183 1324.1786 1338.2125 1341.8781 1345.7390 1351.2271 1355.5709 1358.7185 1359.4886 1387.0905 1388.9992 1392.3602 1452.1595 1455.7243 1457.3724 1457.6560 1464.4571 1467.5617 1470.1071 1471.4143 1476.2814 1484.6119 1485.8004 1490.3157 2956.7291 2964.6903 2965.3364 2967.5314 2968.2960 2976.5743 2985.6111 2986.7309 2991.2896 2995.4072 2997.0662 3002.7495 3008.4372 3018.3893 3023.5979 3024.2870 3031.5457 3033.9633 3046.6375 3053.0939 3072.2845 3083.3552 3084.1140 3103.5675 3104.9426 3553.5181
redmass: 3.8933 2.5707 2.6954 3.5164 3.3663 3.6304 4.2742 2.7355 4.2438 2.5875 1.8801 3.1324 1.4311 1.8357 2.9851 2.2380 2.1160 2.5487 2.3067 1.9630 3.1224 4.5318 4.7302 3.2449 3.2985 1.8432 1.9822 2.2780 4.5631 4.1971 6.0831 3.7670 3.8150 6.6670 4.3673 3.7819 1.1199 1.1356 2.6902 2.7945 3.9300 3.3694 1.5749 1.6540 2.9755 1.5329 2.0274 2.0594 3.0223 2.1615 2.2500 2.8930 2.9454 3.6494 9.3433 1.8362 1.8370 1.7473 2.0881 2.0758 1.7646 1.2394 1.2550 1.1064 1.0127 3.2693 1.5483 1.5572 1.2034 1.1637 1.5813 1.1336 1.7075 1.1183 1.8081 1.8406 1.8675 2.1325 1.6070 1.6133 1.3131 1.4194 1.4501 1.2376 1.4609 1.4826 1.2637 1.5112 1.2424 1.4716 1.2243 1.0770 1.0768 1.0539 1.0436 1.0895 1.0878 1.0720 1.0886 1.0575 1.0659 1.0654 1.0903 1.0601 1.0637 1.0613 1.0606 1.0606 1.0625 1.0365 1.0394 1.0540 1.0836 1.0836 1.0620 1.0837 1.1021 1.1028 1.1025 1.1023 1.1029 1.1021 1.1074 1.1025 1.0975 1.0978 1.1022 1.1029 1.0761
irintensity: 0.3251 1.0841 0.1185 1.9547 0.6703 1.0125 3.2028 8.4554 2.8845 2.4946 0.8312 10.6267 0.8501 9.5793 5.0682 2.8304 0.8041 23.6048 6.2911 25.0512 11.8952 0.0426 0.4036 9.1079 31.1891 0.2291 1.5970 6.0602 39.7988 22.5471 64.7581 0.2080 3.4483 167.1639 10.9790 2.9145 4.3327 7.4422 3.9250 10.6490 25.4077 125.3038 2.2228 18.8978 166.3605 0.4839 1.6938 2.4617 64.6072 1.5082 7.5540 15.8213 126.7522 212.7703 59.1509 3.1962 0.2727 0.0565 26.5185 6.5306 24.9223 4.5362 6.0042 3.7280 0.0501 38.6180 7.5461 5.1334 10.7704 1.5672 17.4243 0.3447 12.6053 2.3856 8.9137 0.6405 0.3266 25.3011 2.5497 1.4939 0.0852 22.5593 1.8944 13.2310 19.9321 1.4261 3.1182 1.1290 20.7371 34.6668 34.2062 1.2706 1.9210 2.1263 14.3928 13.5964 20.2511 2.0356 14.8815 1.3687 9.6428 14.4746 1.1353 28.3721 18.5473 31.9142 23.5131 30.0255 42.1619 15.4927 24.7260 50.6106 145.7223 132.1112 45.4962 48.6663 4.1793 13.4139 27.5202 95.2080 46.3388 23.8272 7.0994 4.4041 36.2090 40.6090 38.7945 37.3570 33.8556
temp: 298.150 k
press: 1.00000 atm
elementType: 15 8 8 8 7 6 6 6 6 6 6 6 6 6 6 6 6 6 6 1 1 1 1 1 1 1 1 1 1 1 1 1 1 1 1 1 1 1 1 1 1 1 1 1 1
symmnumber: 1
zpe: 1018615.2 jmol-1
zpe.correction: 0.387970 hartree
zpe.thermalcorrener: 0.407514 hartree
zpe.thermalcorrenthalpy: 0.408458 hartree
zpe.thermalcorrgfe: 0.337316 hartree
zpe.sumelectzpe: -1169.223306 hartree
zpe.sumelectthermal: -1169.203762 hartree
zpe.sumelectthermalent: -1169.202818 hartree
zpe.sumelectthermalfe: -1169.273960 hartree
dipole: -0.1853 0.8188 -1.6399
dipole: 1.8423
quadrupole: -108.1163 -118.8293 -128.6248
quadrupole: 1.6301 -0.7002 3.6786
quadrupole: 10.4071 -0.3058 -10.1013 1.6301 -0.7002 3.6786
hfenergy: -1169.6112762 hartree
pointgroup: C01 [X(C14H26N1O3P1)]
dipole: -0.0839814 0.1378853 -0.7065955 debye
polarizability: 215.0640976|-4.3447184|175.351678|-2.6890898|-3.03948|155.508736 unknown
InChI: InChI=1S/C14H26NO3P/c1-3-17-19(16,18-4-2)15-14-8-11-5-12(9-14)7-13(6-11)10-14/h11-13,15H,3-10H2,1-2H3
charge 0 multiplicity 1
45 atoms
P  1.872136 -0.4734 -0.131304
O  2.668456 0.661093 -1.203453
O  2.720503 -1.931476 -0.530326
O  1.854361 0.077379 1.369284
N  0.379412 -0.947919 -0.803905
C  -0.958231 -0.441856 -0.395304
C  -2.780577 -0.454976 1.385198
C  -2.418732 1.611667 -0.040923
C  -3.411419 -0.483086 -1.070918
C  -1.3553 -0.95366 1.022131
C  -0.993181 1.113819 -0.404515
C  -1.983917 -0.975847 -1.433844
C  -2.80115 1.098147 1.374062
C  -3.796274 -0.997282 0.343163
C  -3.435473 1.069915 -1.081765
C  3.20018 1.939954 -0.652382
C  4.207692 -1.938825 -0.522522
C  2.548731 3.109914 -1.392149
C  4.774928 -1.96782 0.901559
H  -3.04889 -0.82341 2.394784
H  -2.429387 2.719428 -0.051495
H  -4.128038 -0.873569 -1.820051
H  -0.611924 -0.592826 1.757712
H  -1.3192 -2.061283 1.028011
H  -0.69573 1.47648 -1.408159
H  -0.26077 1.502398 0.3314
H  -1.959163 -2.085588 -1.440701
H  -1.701564 -0.624817 -2.446341
H  -2.087578 1.490423 2.125354
H  -3.808931 1.467788 1.650816
H  -3.798113 -2.105898 0.357503
H  -4.822139 -0.664568 0.598726
H  -3.183059 1.448012 -2.093119
H  -4.454679 1.432985 -0.841238
H  0.418983 -1.738226 -1.450983
H  3.002858 1.977533 0.435839
H  4.29299 1.916259 -0.821086
H  4.456687 -2.859971 -1.075626
H  4.574845 -1.066517 -1.096586
H  2.992124 4.065655 -1.053268
H  2.706899 3.018982 -2.480585
H  1.462856 3.140917 -1.198286
H  5.877828 -2.050253 0.86465
H  4.509768 -1.051946 1.458516
H  4.378483 -2.833324 1.459428
