program: Gaussian 09
title: 000296202
version: EM64L-G09RevD.01
frameworkgroup: C1[X(C15H14N2O4)]
method: RPBEPBE
basis: SDD
operation: Freq
keyword: #p
keyword: freq=noraman
keyword: PBEPBE/SDD
title: #p freq=noraman PBEPBE/SDD
converged: YES YES NO NO
title: Mulliken charges:
elementType: O O O O N N C C C C C C C C C C C C C C C H H H H H H H H H H H H H H
charge: -0.251220 -0.240019 -0.277062 -0.234826 -0.205152 -0.046337 0.177847 -0.023258 -0.161711 -0.236488 -0.300592 0.480561 0.216145 0.186051 -0.393462 -0.366935 -0.236329 -0.233428 -0.238432 -0.496652 -0.497116 0.290493 0.265384 0.220819 0.226957 0.234471 0.230189 0.230360 0.232901 0.238762 0.248044 0.241734 0.242439 0.239671 0.236193
chargesum: 0.00000
title: Mulliken charges with hydrogens summed into heavy atoms:
elementType: O O O O N N C C C C C C C C C C C C C C C
charge: -0.251220 -0.240019 -0.277062 -0.234826 -0.205152 -0.046337 0.177847 -0.023258 0.128781 0.028896 -0.079773 0.480561 0.216145 0.186051 -0.166505 -0.132464 -0.006141 -0.003068 -0.005532 0.231888 0.221187
polarizability: 3.80877152e+02 3.67548672e+00 1.96215695e+02 3.33368573e+00 -1.32517392e+01 9.49084632e+01
1716.lowfreq: -4.8082 -3.8000 -0.0006 -0.0004 0.0006 0.2933 23.1009 27.2339 35.1910
frequency: 22.8594 27.2068 35.1803 42.8259 59.5397 73.6884 81.9448 84.4846 95.6658 129.4319 131.9870 142.5591 184.0806 188.5180 218.3445 239.5843 261.8796 281.6958 311.4543 329.4153 355.9700 377.8736 402.7013 446.0046 482.1501 509.2209 546.0768 606.6152 616.2297 634.9033 660.3097 695.7017 719.4381 733.1406 761.1807 763.9645 768.5639 783.7860 799.9510 844.9135 859.6571 876.1284 887.9694 919.8652 924.1095 975.4202 978.8290 988.0958 995.8186 999.7368 1027.4158 1073.9072 1086.8547 1111.1240 1112.7872 1125.0696 1149.2066 1153.3966 1174.4999 1178.5668 1195.8843 1208.0646 1232.0370 1263.0787 1302.9874 1323.9407 1340.5310 1356.0766 1372.2391 1389.7757 1417.9687 1420.6649 1435.7897 1442.9507 1451.5928 1453.0228 1459.7712 1461.5640 1488.6607 1503.2862 1583.2661 1607.4148 1611.7216 1632.8242 1658.4940 3003.0044 3008.0613 3103.1046 3103.6648 3111.4676 3119.6685 3129.2166 3140.7534 3150.9365 3151.4792 3157.2842 3167.7153 3171.8968 3250.8911
redmass: 4.0507 5.0827 5.3011 5.0160 2.0755 2.0708 1.6328 3.4239 1.5870 4.5229 3.8594 4.7317 5.7173 4.9687 4.6422 3.2852 5.1525 5.2529 4.9022 5.2246 5.9964 8.6515 2.7945 6.0377 5.7622 3.4898 6.2920 5.3147 6.2217 8.1306 4.9851 1.7075 8.4489 6.3354 6.0298 6.2613 1.8191 6.5098 1.7690 1.3092 4.1460 1.7957 8.5419 6.0688 1.5749 1.1520 1.3878 5.9229 6.4060 1.3285 2.2119 6.6257 1.6349 1.2702 1.2684 3.8780 1.5346 1.5653 1.0903 3.0583 1.2059 1.9996 2.3699 3.9074 1.5583 2.9276 1.5748 4.4123 2.4396 4.2350 1.2351 1.5334 2.5022 2.3223 1.0507 1.0501 1.0522 1.0522 2.3806 7.9233 5.6490 9.9434 5.8845 10.7793 5.2299 1.0297 1.0295 1.0906 1.1043 1.1049 1.0874 1.0862 1.0913 1.1045 1.0964 1.1046 1.1015 1.0922 1.0983
irintensity: 0.4120 0.5715 0.3437 0.8474 0.6435 2.9925 0.0829 0.1833 1.1313 4.6290 5.5740 3.2127 0.5746 0.8571 1.5761 1.3969 5.0103 16.4161 14.6889 13.7870 1.8875 4.3403 0.0109 2.8951 3.5361 3.9711 7.5967 19.3100 1.5622 5.7218 11.6222 52.5594 14.0857 2.3594 12.0360 9.2705 47.0235 19.5520 15.9763 0.1086 6.4244 0.4393 8.7148 17.7055 0.5951 65.4154 4.0018 2.4046 78.1122 8.8814 8.7364 147.2233 12.1053 0.1608 0.0702 319.6551 76.5983 89.3724 7.2843 169.9607 8.0261 75.0943 107.6669 16.5916 9.3857 55.8815 43.1495 62.0706 16.3284 8.4350 9.2848 21.5350 148.1805 9.2017 10.5648 17.6513 17.9439 10.4523 0.3263 250.7114 1.1262 115.8415 1.3326 247.1579 7.2092 44.4792 33.0058 16.0908 26.3573 21.2109 9.9342 2.7385 9.9973 16.3696 40.7421 13.3126 22.8419 60.8500 1.1024
temp: 298.150 k
press: 1.00000 atm
elementType: 8 8 8 8 7 7 6 6 6 6 6 6 6 6 6 6 6 6 6 6 6 1 1 1 1 1 1 1 1 1 1 1 1 1 1
symmnumber: 1
zpe: 690438.2 jmol-1
zpe.correction: 0.262974 hartree
zpe.thermalcorrener: 0.283292 hartree
zpe.thermalcorrenthalpy: 0.284236 hartree
zpe.thermalcorrgfe: 0.210608 hartree
zpe.sumelectzpe: -988.863440 hartree
zpe.sumelectthermal: -988.843122 hartree
zpe.sumelectthermalent: -988.842178 hartree
zpe.sumelectthermalfe: -988.915806 hartree
dipole: 2.0740 0.6645 1.5811
dipole: 2.6913
quadrupole: -95.6921 -112.1989 -126.7986
quadrupole: -7.5379 -5.3217 1.4517
quadrupole: 15.8711 -0.6357 -15.2354 -7.5379 -5.3217 1.4517
hfenergy: -989.1264142 hartree
pointgroup: C01 [X(C15H14N2O4)]
dipole: -0.8207684 -0.2706438 0.611747 debye
polarizability: 380.9301258|2.9915865|195.6365087|-1.4278113|15.246716|95.4346758 unknown
InChI: InChI=1S/C15H14N2O4/c1-20-14(18)12-13(15(19)21-2)17(10-16-12)9-8-11-6-4-3-5-7-11/h3-10H,1-2H3
charge 0 multiplicity 1
35 atoms
O  2.558672 -2.080769 0.582493
O  4.657729 1.409484 0.592242
O  0.46707 -2.363662 -0.407372
O  4.466592 -0.37803 -0.892237
N  0.231417 0.637064 -0.157319
N  1.980434 2.098156 -0.153003
C  1.413523 -0.140607 -0.092155
C  2.475981 0.788793 -0.091251
C  -1.10502 0.139502 -0.167386
C  0.64212 1.972474 -0.190699
C  -2.197252 0.900572 0.130601
C  -3.594903 0.441919 0.083929
C  1.39846 -1.610324 -0.009045
C  3.934239 0.512469 -0.188147
C  -4.619204 1.344359 0.491252
C  -3.979008 -0.862284 -0.347167
C  -5.97668 0.961736 0.475858
C  -5.334094 -1.243982 -0.360308
C  -6.341322 -0.336038 0.050479
C  2.739204 -3.551562 0.570688
C  6.131221 1.281836 0.495028
H  -1.161367 -0.916319 -0.440975
H  -0.054363 2.801323 -0.276673
H  -2.056303 1.942862 0.450006
H  -4.342994 2.352794 0.824371
H  -3.219924 -1.580115 -0.676905
H  -6.747201 1.672504 0.793972
H  -5.610311 -2.250239 -0.694333
H  -7.39436 -0.637408 0.035985
H  3.703334 -3.714399 1.070623
H  2.764777 -3.918375 -0.468798
H  1.915024 -4.042029 1.115049
H  6.461053 1.459565 -0.542567
H  6.45024 0.273275 0.808139
H  6.521415 2.052853 1.173423
