program: Gaussian 09
title: 000296255
version: EM64L-G09RevD.01
frameworkgroup: C1[X(C13H23ClNO2P)]
method: RPBEPBE
basis: SDD
operation: Freq
keyword: #p
keyword: freq=noraman
keyword: PBEPBE/SDD
title: #p freq=noraman PBEPBE/SDD
converged: YES YES NO NO
title: Mulliken charges:
elementType: Cl P O O N C C C C C C C C C C C C C H H H H H H H H H H H H H H H H H H H H H H H
charge: -0.020092 1.302880 -0.528604 -0.635957 -0.867384 0.479354 -0.085427 -0.091043 -0.090594 -0.564570 -0.489881 -0.536841 -0.450316 -0.451455 -0.452774 -0.763526 -0.249107 -0.658116 0.198317 0.196466 0.200803 0.188982 0.224334 0.243658 0.178709 0.216510 0.252425 0.198568 0.189795 0.196125 0.196630 0.192954 0.204699 0.333244 0.307875 0.296317 0.221266 0.238530 0.214169 0.238767 0.224309
chargesum: 0.00000
title: Mulliken charges with hydrogens summed into heavy atoms:
elementType: Cl P O O N C C C C C C C C C C C C C
charge: -0.020092 1.302880 -0.528604 -0.635957 -0.534139 0.479354 0.112890 0.105422 0.110209 -0.151255 -0.067513 -0.067906 -0.061953 -0.058700 -0.055121 -0.159334 0.210689 0.019129
polarizability: 1.96351747e+02 -9.05810351e+00 1.81172016e+02 -1.58270318e+00 2.73882732e-01 1.46740710e+02
1716.lowfreq: -11.4783 -7.9591 -0.0021 -0.0013 -0.0006 2.2538 28.2114 34.2326 36.1504
frequency: 27.6998 32.4223 35.6369 48.3703 66.5347 82.3489 109.5063 153.0500 162.4128 202.9329 209.5371 225.5714 249.7423 255.5668 301.1779 322.5331 350.1291 361.2779 390.7797 394.3494 397.1678 402.3027 431.5074 433.7230 447.1303 449.9840 576.9819 618.1808 632.4578 638.7205 640.0593 697.9972 719.9807 764.2688 801.4967 805.0813 808.6560 813.9835 842.1632 863.7220 873.8450 876.2517 884.8236 937.4253 944.9978 949.8614 975.2874 977.9521 986.2281 1017.1795 1025.7844 1045.9706 1047.2877 1050.7380 1087.8124 1092.6535 1101.9268 1104.0554 1108.1011 1111.1523 1119.0826 1126.8297 1145.7921 1183.6784 1188.6833 1222.4141 1252.9557 1265.7303 1274.8181 1284.5585 1286.0262 1290.8271 1296.4872 1309.5079 1315.0058 1323.5325 1338.0246 1341.7242 1351.7322 1353.6128 1356.3171 1361.5935 1385.1249 1388.0970 1396.2989 1453.2981 1455.1965 1458.4525 1465.1599 1466.2642 1469.6641 1472.9363 1483.1944 1488.9889 2950.5748 2961.4076 2963.2104 2966.4170 2969.2928 2984.0215 2985.3755 2994.5245 2997.8051 2998.2431 3009.2659 3018.9145 3023.7150 3025.6266 3032.5872 3036.4405 3051.2756 3068.7404 3073.0917 3080.8726 3102.4121 3169.7749 3520.4320
redmass: 3.4291 4.5591 3.9427 3.2514 3.7000 4.8380 5.5310 4.3333 2.1649 3.8154 4.0076 1.7857 3.5854 2.0640 2.0189 2.3963 1.8841 2.8839 3.9656 4.3935 3.7322 3.0312 2.0669 2.2252 2.2076 2.4541 4.2268 6.4200 6.4464 3.8102 3.9231 4.3910 6.2537 3.8479 1.1314 2.3642 2.7199 2.0058 3.0901 3.2309 1.5786 1.5636 1.5335 2.0290 2.0506 3.1150 2.1571 2.1845 2.9318 3.2354 5.5261 1.8322 1.8071 1.7472 2.1389 1.9777 1.2553 1.2639 1.1219 1.0360 2.1115 1.2314 1.5589 1.1846 1.1680 1.1567 1.5408 1.6982 1.1101 1.8414 1.8414 1.8581 2.1051 1.5796 1.6350 1.3153 1.4084 1.4453 1.4265 1.3461 1.3949 1.5459 1.2461 1.2653 1.1906 1.0824 1.0805 1.0450 1.0916 1.0874 1.0904 1.0667 1.0627 1.0889 1.0618 1.0623 1.0630 1.0616 1.0621 1.0624 1.0359 1.0839 1.0824 1.0619 1.0834 1.1010 1.1013 1.1019 1.1024 1.1011 1.1033 1.1032 1.0545 1.0973 1.1031 1.1113 1.0755
irintensity: 0.2363 0.1248 0.0806 0.3409 4.8080 1.3935 0.3935 7.4096 14.6694 1.0274 6.6484 2.2695 2.9379 4.8642 0.0302 18.0106 38.1919 15.9226 2.4842 3.1744 11.6892 19.1228 15.5202 8.0197 20.9214 10.6360 19.4050 138.7818 39.2920 0.2598 5.1320 4.9884 0.2822 2.3186 7.5599 9.6907 4.1354 1.5930 72.3274 135.8642 0.8096 0.2578 0.0789 1.5062 1.6730 48.8074 1.5836 6.7973 9.1844 150.7145 62.6323 2.7683 1.0317 0.0344 15.0587 58.3109 5.6747 5.0409 4.0817 1.0550 49.2230 7.8737 5.3867 8.5416 1.9792 2.3698 16.5283 7.0780 0.1493 4.7796 3.0468 0.9426 23.6637 2.0836 2.0462 0.0647 12.2238 1.2959 25.1653 6.3644 1.2200 5.4407 16.2540 34.0859 2.7889 0.2550 0.8141 8.9684 15.1546 14.8540 18.6692 3.2393 11.2275 1.1225 26.1842 51.7575 24.6779 28.9527 24.0145 23.1587 18.4754 127.0656 146.0999 38.9032 46.1535 4.0626 26.1639 36.3243 85.0585 29.1751 22.1290 2.9829 4.4340 42.0781 43.0664 0.5203 17.8600
temp: 298.150 k
press: 1.00000 atm
elementType: 17 15 8 8 7 6 6 6 6 6 6 6 6 6 6 6 6 6 1 1 1 1 1 1 1 1 1 1 1 1 1 1 1 1 1 1 1 1 1 1 1
symmnumber: 1
zpe: 911088.5 jmol-1
zpe.correction: 0.347015 hartree
zpe.thermalcorrener: 0.365895 hartree
zpe.thermalcorrenthalpy: 0.366839 hartree
zpe.thermalcorrgfe: 0.298492 hartree
zpe.sumelectzpe: -1514.239650 hartree
zpe.sumelectthermal: -1514.220770 hartree
zpe.sumelectthermalent: -1514.219826 hartree
zpe.sumelectthermalfe: -1514.288173 hartree
dipole: -0.4424 -2.2133 -2.7960
dipole: 3.5933
quadrupole: -115.4561 -123.0388 -128.1646
quadrupole: -4.4011 -2.8983 -0.2590
quadrupole: 6.7637 -0.8190 -5.9448 -4.4011 -2.8983 -0.2590
hfenergy: -1514.5866652 hartree
pointgroup: C01 [X(C13H23Cl1N1O2P1)]
dipole: -0.1448914 0.6818891 1.2299079 debye
polarizability: 197.5561527|6.8827631|178.6330347|4.9567913|5.9595778|148.0752854 unknown
InChI: InChI=1S/C13H23ClNO2P/c1-2-17-18(16,9-14)15-13-6-10-3-11(7-13)5-12(4-10)8-13/h10-12,15H,2-9H2,1H3
charge 0 multiplicity 1
41 atoms
Cl 1.975149 -3.533411 -0.423117
P  2.26881 -0.425028 -0.248691
O  3.513806 0.425339 0.664975
O  2.072681 0.042099 -1.765171
N  0.86922 -0.30788 0.753232
C  -0.532994 -0.079972 0.295724
C  -2.937868 -0.100636 1.131831
C  -2.224829 1.598469 -0.612424
C  -2.412928 -0.853739 -1.23033
C  -1.452273 -0.323493 1.526115
C  -0.739474 1.378852 -0.214605
C  -0.927806 -1.074754 -0.832186
C  -3.129425 1.355426 0.626439
C  -3.32318 -1.095581 0.003309
C  -2.605118 0.60076 -1.740214
C  3.095526 -2.103006 -0.005303
C  3.89357 1.796562 0.222033
C  3.116327 2.869947 0.991408
H  -3.576245 -0.275632 2.020213
H  -2.356977 2.637748 -0.972929
H  -2.677772 -1.567632 -2.034602
H  -1.173194 0.374626 2.344193
H  -1.302056 -1.35646 1.896818
H  -0.072123 1.551319 -1.080772
H  -0.448025 2.089212 0.586721
H  -0.769279 -2.109786 -0.473798
H  -0.271945 -0.918859 -1.709835
H  -4.192084 1.525289 0.361614
H  -2.873364 2.07461 1.430905
H  -3.210514 -2.139058 0.360215
H  -4.387216 -0.956752 -0.274291
H  -3.658096 0.75913 -2.048448
H  -1.969885 0.776038 -2.630665
H  1.04973 -0.150538 1.749041
H  3.964739 -2.157159 -0.67508
H  3.393876 -2.20235 1.04724
H  4.975576 1.85696 0.429083
H  3.728065 1.881014 -0.869686
H  3.497075 3.873374 0.721607
H  2.039881 2.835633 0.74913
H  3.239441 2.735719 2.080303
