program: Gaussian 09
title: 000296237
version: EM64L-G09RevD.01
frameworkgroup: C1[X(C12H16FN5O3S)]
method: RPBEPBE
basis: SDD
operation: Freq
keyword: #p
keyword: freq=noraman
keyword: PBEPBE/SDD
title: #p freq=noraman PBEPBE/SDD
converged: NO YES NO NO
title: Mulliken charges:
elementType: S F O O O N N N N N C C C C C C C C C C C C H H H H H H H H H H H H H H H H
charge: 0.184155 -0.150019 -0.273727 -0.447251 -0.428285 -0.206219 -0.080499 -0.130537 -0.062386 -0.603730 -0.119429 -0.144186 -0.044917 -0.051678 -0.760650 0.178091 -0.205548 -0.108814 -0.582337 0.189394 0.007876 -0.651603 0.236778 0.274643 0.254779 0.273049 0.284093 0.265930 0.385692 0.338338 0.298886 0.246344 0.250539 0.231612 0.231586 0.221855 0.353535 0.344640
chargesum: 0.00000
title: Mulliken charges with hydrogens summed into heavy atoms:
elementType: S F O O O N N N N N C C C C C C C C C C C C
charge: 0.184155 -0.150019 -0.273727 -0.061559 -0.089947 -0.206219 -0.080499 -0.130537 -0.062386 0.094445 0.117349 0.130456 0.209863 0.221371 -0.210627 0.178091 0.093338 -0.108814 -0.085454 0.189394 0.007876 0.033449
polarizability: 2.71317221e+02 -7.17288947e-01 1.82462682e+02 -9.10213799e+00 -1.59154078e+01 1.26628957e+02
1716.lowfreq: -25.8571 -10.3850 -7.5677 -3.4909 -0.0015 -0.0003 0.0004 13.0845 23.0030
frequency: -24.3098 12.0469 22.7532 42.4329 46.6012 57.6621 74.4794 97.6048 130.6760 144.5717 175.0046 187.8712 216.9518 226.3724 239.7279 240.2275 262.6327 287.8333 291.6318 318.9044 339.3536 358.0074 365.2966 385.6203 426.8079 465.8610 481.3902 527.9306 548.7983 550.2783 557.8669 572.7072 620.0668 631.0340 636.1456 651.1455 658.8720 680.1151 685.5697 702.6052 709.7395 773.2760 783.3075 789.6685 804.2846 837.9171 844.8437 914.9691 926.0883 937.3608 973.2782 983.0300 995.8692 1013.2928 1026.0837 1027.0488 1042.3794 1057.8621 1061.5794 1069.8484 1073.9009 1171.7246 1177.1740 1183.1338 1190.0480 1200.4385 1226.4434 1239.7505 1249.7779 1255.7002 1268.7249 1280.7723 1283.6780 1291.3665 1309.1976 1335.9931 1346.5875 1358.7695 1363.7807 1373.9324 1396.3622 1406.1996 1410.1688 1434.6004 1442.8199 1458.4570 1470.3574 1478.3734 1484.1277 1551.5614 1582.7865 1640.4490 2967.6073 2977.6358 2987.0117 3004.8896 3016.4441 3066.7925 3067.1616 3081.7529 3091.8817 3098.7264 3099.9672 3263.2620 3298.3847 3536.0713 3536.9472 3688.9745
redmass: 7.0343 4.4211 4.4196 6.3846 2.0197 5.4070 7.1386 5.9103 8.7275 7.2553 4.8846 6.3087 4.6572 6.2430 3.9193 1.1230 4.5515 3.8941 4.8527 4.1878 1.3504 4.1753 8.0670 5.5195 4.6244 4.6376 8.6701 3.5576 1.2709 6.4373 1.1015 6.2231 4.1761 4.1427 4.6229 7.5841 7.1628 3.3300 5.1747 1.6981 3.4325 6.1115 8.6064 1.1292 4.2783 2.3702 2.2325 2.6127 3.8107 2.9335 4.9701 5.1209 1.8155 2.5874 5.7603 1.2491 3.9909 3.5191 4.3951 2.8442 2.5586 2.2283 1.2666 1.7454 1.3205 1.5398 1.3045 1.2473 2.8683 1.2474 1.2578 1.3041 1.4212 1.8464 3.3752 3.2593 1.2254 1.4529 4.7647 1.2591 1.2033 7.4312 1.5852 1.1368 4.4643 1.0882 1.0391 5.1014 1.0477 8.1432 1.9112 2.7555 1.0833 1.0854 1.0354 1.0566 1.0606 1.0901 1.1060 1.0989 1.1006 1.1033 1.0875 1.0994 1.0663 1.0448 1.0660 1.1057
irintensity: 0.4447 1.0418 0.4489 2.0125 0.5197 2.3523 5.3871 0.7057 4.4779 2.3499 0.2291 7.5478 1.9998 4.7286 1.2171 0.0308 5.5883 13.2631 1.1461 12.7797 94.5779 17.9300 3.2319 7.7769 10.7971 5.5763 7.0246 19.9127 160.6981 14.4653 73.6675 9.7906 1.7727 36.0244 10.5324 34.3436 14.7287 10.8197 9.3867 124.4642 12.1546 15.9881 17.0650 12.7594 6.9253 19.3072 14.0866 25.3222 29.8724 28.1184 130.2185 29.8323 10.6644 67.4463 25.6174 1.0181 25.1646 17.4196 31.2961 30.1406 14.9565 49.6038 27.0029 33.6541 45.4747 27.8093 5.4844 0.1650 73.0247 14.7969 34.4976 11.3534 1.4859 73.9655 52.1926 271.8819 7.8710 50.9062 47.9621 10.2692 18.6147 97.8840 48.4483 39.8571 34.1374 5.4114 14.9934 64.7167 8.5095 100.8879 75.6998 700.3211 2.1883 46.2145 33.9264 26.8775 12.8514 7.0565 4.0527 28.0758 17.5753 48.5545 4.9771 5.0220 315.5232 161.2643 9.4329 58.6863
temp: 298.150 k
press: 1.00000 atm
elementType: 16 9 8 8 8 7 7 7 7 7 6 6 6 6 6 6 6 6 6 6 6 6 1 1 1 1 1 1 1 1 1 1 1 1 1 1 1 1
symmnumber: 1
zpe: 754926.5 jmol-1
zpe.correction: 0.287536 hartree
zpe.thermalcorrener: 0.308075 hartree
zpe.thermalcorrenthalpy: 0.309020 hartree
zpe.thermalcorrgfe: 0.235694 hartree
zpe.sumelectzpe: -1462.544424 hartree
zpe.sumelectthermal: -1462.523885 hartree
zpe.sumelectthermalent: -1462.522941 hartree
zpe.sumelectthermalfe: -1462.596267 hartree
dipole: -1.3286 -3.9183 2.0004
dipole: 4.5956
quadrupole: -112.9205 -148.4932 -139.5974
quadrupole: -18.8443 3.3799 -2.7090
quadrupole: 20.7499 -14.8229 -5.9270 -18.8443 3.3799 -2.7090
hfenergy: -1462.8319607 hartree
pointgroup: C01 [X(C12H16F1N5O3S1)]
dipole: 0.4738496 -1.6076411 -0.6782021 debye
polarizability: 270.9928505|-7.6888669|184.1253367|6.8475011|13.5065461|125.2906729 unknown
InChI: InChI=1S/C12H16FN5O3S/c1-2-22-3-5-7(19)8(20)11(21-5)18-4-15-6-9(14)16-12(13)17-10(6)18/h4-5,7-8,11,19-20H,2-3,14H2,1H3
charge 0 multiplicity 1
38 atoms
S  4.378938 -1.051497 1.641746
F  -4.007572 2.502053 0.7473
O  1.814173 -0.637374 -0.391426
O  0.346462 2.543109 0.470843
O  2.414266 1.882632 -2.332846
N  -0.553665 -0.637831 -0.249676
N  -1.992697 -2.307126 -0.882774
N  -2.198505 1.135674 0.319521
N  -4.503853 0.380863 -0.015817
N  -5.066618 -1.772317 -0.79482
C  0.737019 1.530329 -0.48637
C  2.233109 1.682641 -0.892181
C  0.661671 0.092344 0.126499
C  2.921942 0.373096 -0.397601
C  3.580955 0.526682 0.983164
C  -1.835892 -0.117164 -0.108863
C  -0.702601 -1.959846 -0.711251
C  -2.713906 -1.160133 -0.503275
C  6.050356 -0.935317 0.743025
C  -4.109846 -0.867444 -0.444979
C  -3.544311 1.258651 0.323186
C  6.910847 -2.148245 1.125315
H  0.113923 1.572407 -1.404386
H  2.655339 2.588563 -0.43293
H  0.702611 0.175085 1.233376
H  3.650537 0.001822 -1.136762
H  2.856347 0.84842 1.750355
H  4.368272 1.300308 0.925744
H  -0.640904 2.420283 0.620664
H  2.060514 1.09116 -2.815837
H  0.160343 -2.591608 -0.900125
H  5.862349 -0.911867 -0.34485
H  6.531639 0.010923 1.04753
H  7.091456 -2.182527 2.214312
H  6.423574 -3.093239 0.826712
H  7.891323 -2.093039 0.617467
H  -4.792079 -2.70033 -1.11198
H  -6.048614 -1.510042 -0.731609
