program: Gaussian 09
title: 000027258
version: EM64L-G09RevD.01
frameworkgroup: C1[X(C16H25N3O)]
method: RPBEPBE
basis: SDD
operation: Freq
keyword: #p
keyword: freq=noraman
keyword: PBEPBE/SDD
title: #p freq=noraman PBEPBE/SDD
converged: YES YES NO NO
title: Mulliken charges:
elementType: O N N N C C C C C C C C C C C C C C C C H H H H H H H H H H H H H H H H H H H H H H H H H
charge: -0.240086 -0.312153 -0.409343 -0.002481 -0.031346 -0.118094 -0.464927 0.020507 -0.474178 -0.440119 -0.054552 -0.755848 -0.736929 -0.734191 0.192127 0.298790 -0.291080 -0.315637 -0.324531 -0.330935 0.180332 0.211388 0.193634 0.219907 0.274275 0.199894 0.195906 0.197478 0.182195 0.188345 0.287560 0.215592 0.198437 0.215923 0.212472 0.216594 0.214797 0.226622 0.212308 0.206567 0.289401 0.272102 0.224475 0.246199 0.242606
chargesum: 0.00000
title: Mulliken charges with hydrogens summed into heavy atoms:
elementType: O N N N C C C C C C C C C C C C C C C C
charge: -0.240086 -0.024593 -0.119943 -0.002481 0.148985 0.093294 -0.051386 0.294782 -0.078378 -0.060446 0.133793 -0.125897 -0.093065 -0.088694 0.192127 0.298790 -0.018978 -0.091162 -0.078332 -0.088329
polarizability: 2.49746738e+02 5.20463971e+00 1.68525076e+02 4.27417884e+00 -1.78005275e+01 1.64408457e+02
1716.lowfreq: -11.6525 -5.9932 0.0004 0.0007 0.0008 6.0551 19.3712 27.1376 36.5193
frequency: 18.8442 26.8343 36.4950 54.9973 63.2009 75.2043 105.1581 112.9928 147.0475 167.1152 189.4720 202.4887 210.5534 228.8913 233.0863 257.0309 297.5766 303.2834 313.1713 334.4255 359.7955 366.1187 386.6077 407.6755 410.8868 428.9303 442.8131 485.7031 506.8636 530.2290 573.3907 619.8675 659.9337 674.2408 689.0299 704.7645 753.3233 759.1095 810.2748 835.9313 842.6602 859.2482 865.2588 883.7584 890.3431 913.3648 933.7892 937.7000 954.1071 957.4898 960.5139 966.1068 985.8151 993.4075 1014.9337 1036.0430 1059.7989 1064.0151 1070.9586 1081.7798 1086.3850 1107.1393 1117.2712 1142.7190 1169.5454 1172.8650 1185.1736 1203.3720 1219.9718 1227.2416 1246.6416 1258.2051 1266.3318 1276.2080 1298.7622 1299.8373 1317.2491 1319.1795 1323.1420 1323.7840 1334.4568 1340.3866 1349.2351 1364.0654 1370.1010 1378.5220 1385.1794 1395.8243 1398.4241 1425.6529 1452.7220 1456.8440 1460.6178 1464.0614 1469.9885 1473.2100 1473.8927 1476.7710 1479.4746 1493.0551 1514.0105 1546.7421 1580.0882 1620.0079 2859.2207 2929.4106 2945.6503 2948.1119 2959.0696 2962.6923 2969.3513 2974.0635 2981.6412 2993.8835 3016.3368 3024.4663 3043.6718 3054.0411 3060.3450 3063.4291 3064.4849 3069.2177 3085.8808 3124.6405 3140.2255 3148.2890 3173.3742 3393.4997 3451.6916
redmass: 4.8266 3.9527 4.1071 6.5289 2.6316 2.8239 4.5336 4.4205 3.4007 1.8452 1.4763 1.7774 1.1496 3.2411 1.3890 2.9953 2.5896 2.6071 3.7061 3.4227 2.5771 2.5626 2.8540 3.6020 2.2961 2.0726 2.2172 2.3871 4.3462 2.5984 1.2875 3.2641 6.7464 5.0367 3.4786 3.7893 2.9206 2.6554 1.8137 1.7433 2.2206 2.4905 4.0238 1.9410 1.2625 1.1812 1.5031 2.1241 1.4648 3.3235 1.6237 1.8220 1.4483 1.7230 1.8581 4.0672 2.4164 2.0222 1.3833 1.8217 1.6448 2.7504 2.0188 2.1592 1.9167 2.2263 2.7389 2.2610 1.3296 1.4674 1.3000 1.6741 1.9530 1.3607 1.5988 3.9221 1.4424 1.2612 1.3418 1.4959 1.3031 1.4936 1.4465 1.4234 1.4790 1.2145 1.2434 1.2060 1.8384 1.2387 1.0862 1.0815 1.8815 1.0550 1.0895 1.0477 1.0510 1.0574 1.0572 1.0487 1.5592 7.4834 5.5899 8.5404 1.0809 1.0808 1.0645 1.0825 1.0423 1.0584 1.0360 1.0375 1.0624 1.0818 1.0973 1.0974 1.1022 1.0980 1.0990 1.0991 1.0990 1.0985 1.0977 1.0874 1.0896 1.0973 1.0965 1.0760 1.0755
irintensity: 0.3471 0.3435 0.2794 4.2377 0.0869 0.1263 1.9816 0.8751 7.5310 1.7864 1.6940 3.5918 0.3742 4.6932 0.2213 4.5833 0.1620 0.1474 5.5279 1.1197 13.6459 2.1508 3.5282 3.7278 2.3486 9.2556 2.6698 21.8952 2.3651 13.9881 81.9486 31.1981 1.2976 11.3017 12.3553 19.0096 8.8302 3.1823 0.3514 31.5418 1.1458 12.3066 5.0071 10.1092 3.6020 3.3842 5.7334 3.7311 3.0298 1.6693 1.8012 3.0795 0.8312 8.2973 14.2980 24.1721 9.5744 1.1243 1.7729 4.6610 0.3519 0.1204 0.4672 7.5858 9.8179 7.4664 5.9231 28.9323 1.2135 9.9437 4.0927 36.2026 71.7978 1.0908 0.3008 0.7798 6.7884 2.8759 3.9407 2.4754 2.8646 4.3807 1.0498 5.4706 5.6349 16.9907 9.0233 20.6643 15.9168 11.4928 3.7728 7.9922 5.1949 1.7934 5.2844 2.6500 13.0029 12.9422 3.3912 28.2958 121.6565 33.3878 8.1836 128.6128 76.2657 6.7395 32.6875 42.9328 29.0039 73.5619 34.4231 36.3777 33.0320 5.5438 61.8739 20.5153 45.0806 72.4927 22.9828 46.0175 48.4090 80.0441 37.4198 9.9484 27.8516 16.5200 5.8600 47.2020 0.6597
temp: 298.150 k
press: 1.00000 atm
elementType: 8 7 7 7 6 6 6 6 6 6 6 6 6 6 6 6 6 6 6 6 1 1 1 1 1 1 1 1 1 1 1 1 1 1 1 1 1 1 1 1 1 1 1 1 1
symmnumber: 1
zpe: 1015363.3 jmol-1
zpe.correction: 0.386731 hartree
zpe.thermalcorrener: 0.407438 hartree
zpe.thermalcorrenthalpy: 0.408382 hartree
zpe.thermalcorrgfe: 0.335888 hartree
zpe.sumelectzpe: -862.613848 hartree
zpe.sumelectthermal: -862.593141 hartree
zpe.sumelectthermalent: -862.592197 hartree
zpe.sumelectthermalfe: -862.664691 hartree
dipole: -3.2234 -3.1253 1.8267
dipole: 4.8471
quadrupole: -135.1242 -122.4927 -120.7265
quadrupole: 2.4638 -2.6795 0.6004
quadrupole: -9.0098 3.6218 5.3880 2.4638 -2.6795 0.6004
hfenergy: -863.000579 hartree
pointgroup: C01 [X(C16H25N3O1)]
dipole: 1.2606712 -1.2236107 -0.7417272 debye
polarizability: 249.6964978|-5.7046998|167.9553866|4.1812173|17.8456272|165.0283866 unknown
InChI: InChI=1S/C16H25N3O/c1-11(2)14-5-4-12(3)10-15(14)18-19-16(20)13-6-8-17-9-7-13/h6-9,11-12,14-15,18-19H,4-5,10H2,1-3H3
charge 0 multiplicity 1
45 atoms
O  -1.255676 0.93359 1.611566
N  0.841391 -0.632342 0.477133
N  -0.528215 -0.798052 0.199296
N  -5.6267 -0.618573 -0.528784
C  3.196131 -0.339208 -0.259071
C  1.69841 -0.292485 -0.692422
C  3.49314 0.807105 0.747174
C  1.610335 2.245858 -0.240903
C  1.322941 1.104083 -1.243838
C  3.096332 2.193332 0.18696
C  3.671194 -1.738512 0.2607
C  1.237683 3.618373 -0.837592
C  3.219508 -2.906247 -0.653379
C  5.213356 -1.784191 0.41266
C  -1.497023 0.038056 0.75404
C  -2.908342 -0.229984 0.268523
C  -3.979459 0.118746 1.127378
C  -3.227588 -0.758152 -1.008854
C  -5.30543 -0.096759 0.695333
C  -4.587268 -0.930893 -1.357679
H  3.771776 -0.133765 -1.189814
H  1.547275 -1.034869 -1.515906
H  4.568552 0.811249 1.005437
H  2.931244 0.621093 1.683702
H  0.984399 2.063263 0.655043
H  0.252663 1.115374 -1.531139
H  1.904323 1.270711 -2.175685
H  3.294042 2.973133 0.948869
H  3.735584 2.435469 -0.690451
H  3.241751 -1.903809 1.274631
H  1.204001 -1.387084 1.072078
H  1.425015 4.431754 -0.111571
H  1.832833 3.835133 -1.747277
H  0.167343 3.6577 -1.114787
H  2.120034 -3.009811 -0.704942
H  3.62386 -3.865215 -0.279625
H  3.593871 -2.763345 -1.685398
H  5.586207 -1.039495 1.136519
H  5.541108 -2.781081 0.761143
H  5.703798 -1.588937 -0.561061
H  -0.82602 -1.541164 -0.448215
H  -3.760853 0.559677 2.104345
H  -2.454549 -0.999158 -1.747273
H  -6.153716 0.155818 1.340867
H  -4.865161 -1.327985 -2.34063
