program: Gaussian 09
title: 000296165
version: EM64L-G09RevD.01
frameworkgroup: C1[X(C16H13NO3)]
method: RPBEPBE
basis: SDD
operation: Freq
keyword: #p
keyword: freq=noraman
keyword: PBEPBE/SDD
title: #p freq=noraman PBEPBE/SDD
converged: YES YES NO NO
title: Mulliken charges:
elementType: O O O N C C C C C C C C C C C C C C C C H H H H H H H H H H H H H
charge: -0.226053 -0.442645 -0.250132 -0.032312 0.300789 0.441119 -0.323201 -0.349360 -0.438648 -0.363149 0.219265 0.111535 0.086355 -0.806112 -0.359428 -0.298163 -0.346255 -0.211903 -0.237898 0.107432 0.325698 0.271179 0.236876 0.232561 0.232348 0.228450 0.236357 0.259171 0.280942 0.254374 0.237500 0.238576 0.384731
chargesum: 0.00000
title: Mulliken charges with hydrogens summed into heavy atoms:
elementType: O O O N C C C C C C C C C C C C C C C C
charge: -0.226053 -0.057915 -0.250132 -0.032312 0.300789 0.441119 0.002497 -0.078182 -0.201772 -0.130588 0.219265 0.111535 0.086355 -0.108956 -0.100257 -0.017221 -0.091882 0.025597 0.000679 0.107432
polarizability: 3.13722354e+02 -9.71137887e+00 2.21976199e+02 6.69490867e+00 7.81960993e-01 9.33730326e+01
1716.lowfreq: -6.7113 -3.0526 -0.0006 -0.0001 0.0005 4.2061 15.5328 22.2070 36.8590
frequency: 15.0534 21.8754 36.8443 57.9133 69.4405 84.0418 97.6546 110.8007 143.7854 159.7402 196.7965 222.7750 265.9336 281.2980 325.7781 342.3648 353.5646 399.1159 405.7881 421.7401 473.2267 495.0095 520.1386 531.8484 567.0882 581.5690 603.6646 616.3785 637.0294 654.5494 683.0355 691.0959 724.0555 754.2426 769.0600 781.4302 805.4842 828.5345 853.5058 865.1892 878.4671 962.8899 968.8805 984.4835 992.6402 994.6108 996.4690 1001.5191 1011.3669 1042.3831 1046.3375 1061.6587 1110.3362 1129.7866 1160.1196 1177.1707 1197.4063 1202.0832 1226.3627 1267.9305 1298.0850 1315.5601 1322.2926 1335.2792 1372.2289 1380.4865 1395.2194 1416.5228 1427.6049 1467.8084 1469.8258 1470.8926 1505.0854 1529.8602 1567.4681 1575.2157 1593.3004 1617.9238 1620.2337 1633.5155 2976.4930 2986.0217 3053.9331 3090.6089 3123.0272 3133.0862 3136.2103 3151.9895 3156.2698 3164.9884 3175.3115 3183.9929 3533.0979
redmass: 1.7263 1.8558 5.0028 4.9656 8.5575 6.4188 4.1703 5.3368 5.0448 5.0463 4.4037 5.8186 4.6844 4.9026 5.2530 3.3666 7.5919 5.7856 2.9527 3.2995 3.1137 6.3555 3.5421 6.0288 5.5410 1.2301 5.2680 5.9597 6.5513 4.1891 3.7219 4.3973 3.8109 3.3589 2.3990 1.9696 4.9600 3.7662 1.8504 1.2433 1.4669 1.6845 1.3831 1.4645 1.4034 3.8490 1.4196 1.4003 2.9890 2.2848 1.5941 4.1460 1.8699 1.3218 1.6578 1.0846 2.8120 1.1549 2.9209 1.5730 4.2561 2.4908 1.3133 1.4344 4.4213 6.1184 1.2565 3.5214 2.4298 1.0749 1.8585 1.3176 2.5385 6.9042 6.9927 6.1165 6.3998 6.6273 8.0693 8.5920 1.0379 1.0880 1.0965 1.0988 1.0888 1.0906 1.0863 1.0912 1.0953 1.0963 1.0958 1.0973 1.0642
irintensity: 2.1872 0.1631 0.6398 1.5012 1.2246 0.3049 0.3868 8.3991 3.1319 9.8072 17.7481 5.8637 0.9396 0.9120 4.7422 4.3797 7.0983 8.0971 0.5290 8.4924 14.8261 36.2809 11.2711 4.9242 16.3783 105.6244 32.4958 16.2735 5.9045 9.7214 48.2768 18.9265 5.3862 28.9233 72.6156 21.2236 12.7608 40.8680 43.5644 1.7027 0.8448 22.5860 5.2417 6.3012 12.7340 250.5228 16.7403 5.3346 4.1362 10.6635 15.9381 6.2689 64.1767 11.2248 107.0276 0.4708 6.6354 31.6384 0.3161 12.7703 224.3753 84.9900 4.7688 2.6575 6.8487 2.4438 18.9846 22.2337 7.6371 20.1379 78.9028 1.2519 5.7225 199.2639 49.4429 36.2555 5.1304 120.5549 19.2641 288.0348 27.3700 35.6160 18.3554 16.9139 18.0863 17.0249 2.8983 7.8639 8.5182 14.6136 44.9150 8.6455 48.7709
temp: 298.150 k
press: 1.00000 atm
elementType: 8 8 8 7 6 6 6 6 6 6 6 6 6 6 6 6 6 6 6 6 1 1 1 1 1 1 1 1 1 1 1 1 1
symmnumber: 1
zpe: 652208.7 jmol-1
zpe.correction: 0.248413 hartree
zpe.thermalcorrener: 0.266466 hartree
zpe.thermalcorrenthalpy: 0.267410 hartree
zpe.thermalcorrgfe: 0.199179 hartree
zpe.sumelectzpe: -896.524560 hartree
zpe.sumelectthermal: -896.506507 hartree
zpe.sumelectthermalent: -896.505563 hartree
zpe.sumelectthermalfe: -896.573793 hartree
dipole: 1.7950 2.5105 0.8557
dipole: 3.2027
quadrupole: -86.7495 -110.4195 -119.3861
quadrupole: -10.1789 -2.6949 -4.7693
quadrupole: 18.7688 -4.9011 -13.8677 -10.1789 -2.6949 -4.7693
hfenergy: -896.7729728 hartree
pointgroup: C01 [X(C16H13N1O3)]
dipole: 0.6643589 -0.4435656 0.974441 debye
polarizability: 307.2611409|-36.9192254|99.5673598|-11.2208316|-0.3396758|222.2430853 unknown
InChI: InChI=1S/C16H13NO3/c1-11-6-8-12(9-7-11)15(18)10-17-14-5-3-2-4-13(14)16(19)20/h2-10,19H,1H3
charge 0 multiplicity 1
33 atoms
O  -1.624759 0.769067 -3.282129
O  2.774663 -0.306874 2.864515
O  0.8787 0.423632 1.755433
N  0.609004 -0.446123 -0.855556
C  -2.405264 0.262315 -1.045401
C  -4.535828 -0.058206 0.831628
C  -2.127204 0.182105 0.347433
C  -3.758128 0.187821 -1.488601
C  -3.188308 0.026833 1.264546
C  -4.802022 0.023886 -0.565916
C  1.986555 -0.739018 -0.76021
C  2.680853 -0.668009 0.494072
C  -1.351726 0.472234 -2.071079
C  -5.673721 -0.217282 1.821912
C  2.681453 -1.23313 -1.902271
C  4.03448 -1.090797 0.566988
C  0.121428 0.344836 -1.768033
C  4.024026 -1.645579 -1.807185
C  4.707958 -1.576872 -0.569537
C  2.004196 -0.132187 1.69796
H  -1.098334 0.241853 0.71161
H  -3.956196 0.263298 -2.563198
H  -2.964015 -0.029355 2.336171
H  -5.838191 -0.040921 -0.920149
H  -6.324643 -1.069638 1.552254
H  -5.301381 -0.381137 2.846964
H  -6.315123 0.685064 1.836104
H  2.138996 -1.321418 -2.849621
H  4.544399 -1.022719 1.531382
H  0.757564 0.926635 -2.466331
H  4.536655 -2.023124 -2.698769
H  5.751332 -1.898667 -0.49521
H  2.271678 0.079176 3.63062
