program: Gaussian 09
title: 000296156
version: EM64L-G09RevD.01
frameworkgroup: C1[X(C9H18N2S2)]
method: RPBEPBE
basis: SDD
operation: Freq
keyword: #p
keyword: freq=noraman
keyword: PBEPBE/SDD
title: #p freq=noraman PBEPBE/SDD
converged: YES YES NO NO
title: Mulliken charges:
elementType: S S N N C C C C C C C C C H H H H H H H H H H H H H H H H H H
charge: 0.254370 0.011926 -0.037871 0.041943 -0.338948 -0.373817 -0.360138 -0.666272 -0.345455 -0.344882 -0.580569 -0.687914 -0.679301 0.225852 0.250767 0.222254 0.199942 0.258744 0.196481 0.264949 0.285800 0.196806 0.238666 0.241560 0.196658 0.194119 0.224261 0.258910 0.224399 0.223374 0.203385
chargesum: 0.00000
title: Mulliken charges with hydrogens summed into heavy atoms:
elementType: S S N N C C C C C C C C C
charge: 0.254370 0.011926 -0.037871 0.041943 0.137672 0.048380 0.095087 -0.115523 0.090017 0.093336 -0.580569 -0.010624 -0.028143
polarizability: 1.67710171e+02 -4.77191460e+00 1.45414075e+02 -2.05898926e+01 1.31073672e+01 1.23621406e+02
1716.lowfreq: -12.7789 -0.0012 -0.0011 0.0013 5.9260 10.8370 38.3679 45.1130 49.9429
frequency: 37.9629 44.6039 49.8799 56.3544 83.4450 103.7031 119.2231 147.7166 204.8880 221.0016 238.7187 268.0576 291.6804 321.6779 331.6550 356.8235 365.4636 412.6383 429.4764 484.8906 516.3095 543.9586 550.8991 624.0057 730.7988 738.4823 830.6092 834.5073 865.8545 870.2639 885.0578 901.9841 910.4192 931.8097 992.3752 1049.3471 1052.9519 1081.4202 1100.1502 1106.6795 1109.0700 1129.6649 1155.0481 1187.5879 1230.7923 1242.0932 1253.8561 1277.9486 1291.8121 1301.2391 1310.0728 1337.9724 1349.6884 1361.9607 1366.6648 1375.1336 1389.1782 1392.2366 1421.2344 1441.3209 1450.3614 1460.7336 1465.5641 1469.8265 1472.0079 1477.2184 1479.3577 1484.5211 1490.6795 2960.7867 2969.4439 2975.5120 2977.3190 2978.1490 2981.7258 2984.8178 3029.7039 3030.6482 3039.5468 3039.8691 3058.8223 3067.1317 3070.1169 3077.1049 3082.3254 3102.2210 3124.8990
redmass: 3.5531 2.7209 4.5194 4.4876 1.7124 3.8648 2.0706 4.3697 1.3221 1.1921 2.8755 2.4155 4.5193 4.5643 5.6173 3.0724 2.3049 3.2306 2.1725 2.5280 8.6818 6.5611 5.2376 5.6643 1.5871 1.1184 2.1537 2.0139 1.8811 1.8529 1.5458 2.1710 2.0663 2.9118 2.0549 3.0571 1.9219 2.2195 1.9566 2.2691 2.6999 1.6080 2.1529 2.0804 1.3112 1.3071 1.2526 1.1940 1.2842 1.3187 1.2024 1.4878 1.3505 1.3258 1.5599 1.6267 1.2074 1.2174 1.4910 1.0975 1.0986 1.0908 1.1085 1.2309 1.0846 1.0565 1.0725 1.0765 1.0601 1.0656 1.0616 1.0449 1.0445 1.0501 1.0599 1.0642 1.0793 1.0801 1.0995 1.0952 1.1013 1.0977 1.0980 1.1012 1.1001 1.0978 1.1098
irintensity: 0.2581 0.5132 0.7137 1.5873 0.3324 0.5715 1.3866 1.5924 0.0970 0.3686 2.6298 0.0837 1.6504 2.5459 6.9878 2.9223 5.6414 1.4530 0.5101 2.3109 4.8302 22.9749 12.2166 33.1128 9.0543 12.5735 9.8303 41.5624 3.1527 12.4917 13.9169 3.8896 26.2901 21.0778 20.5263 1.8828 16.6379 39.5403 7.0417 19.0266 123.7663 16.7731 52.1254 7.7902 10.4050 37.9419 28.1355 1.9754 51.4090 50.5843 23.4453 14.8616 18.1673 2.4856 37.4475 16.7343 11.2563 13.4559 50.0078 6.5199 13.7284 17.7802 20.5282 34.2965 23.7367 20.6869 5.1563 21.6463 14.3283 42.3705 32.3148 17.5549 11.4172 75.0593 64.4205 44.0991 23.0123 50.1464 20.0951 0.9534 3.5485 7.3495 43.0239 58.5719 41.3715 29.1033 8.7647
temp: 298.150 k
press: 1.00000 atm
elementType: 16 16 7 7 6 6 6 6 6 6 6 6 6 1 1 1 1 1 1 1 1 1 1 1 1 1 1 1 1 1 1
symmnumber: 1
zpe: 690321.4 jmol-1
zpe.correction: 0.262930 hartree
zpe.thermalcorrener: 0.278612 hartree
zpe.thermalcorrenthalpy: 0.279556 hartree
zpe.thermalcorrgfe: 0.218584 hartree
zpe.sumelectzpe: -1258.313177 hartree
zpe.sumelectthermal: -1258.297494 hartree
zpe.sumelectthermalent: -1258.296550 hartree
zpe.sumelectthermalfe: -1258.357523 hartree
dipole: 1.6626 -5.6488 -2.4143
dipole: 6.3641
quadrupole: -88.1944 -103.9662 -95.3567
quadrupole: 3.3175 0.7888 -3.5423
quadrupole: 7.6447 -8.1271 0.4824 3.3175 0.7888 -3.5423
hfenergy: -1258.5761062 hartree
pointgroup: C01 [X(C9H18N2S2)]
dipole: -0.6811256 -2.1565137 1.0745974 debye
polarizability: 156.163893|0.2837262|145.2072161|-29.8359942|-10.2991372|135.3745429 unknown
InChI: InChI=1S/C9H18N2S2/c1-3-5-10-7-11(6-4-2)9(12)13-8-10/h3-8H2,1-2H3
charge 0 multiplicity 1
31 atoms
S  -0.967083 2.21369 0.860833
S  1.119745 2.130182 -1.287407
N  -1.599121 -0.478807 1.559982
N  0.435466 -0.1020 0.15033
C  -0.23025 -0.849892 1.290124
C  -2.731946 -1.079387 0.809986
C  1.451384 -0.878453 -0.610734
C  -1.727462 0.845898 2.085753
C  -3.147778 -0.449901 -0.550741
C  2.843263 -0.878349 0.06317
C  0.272523 1.241788 -0.092091
C  -2.302242 -0.892151 -1.7642
C  3.869133 -1.676223 -0.769052
H  -0.173449 -1.919971 1.029574
H  0.372076 -0.675412 2.205541
H  -3.603272 -1.04645 1.493715
H  -2.488996 -2.149826 0.66029
H  1.531468 -0.431528 -1.617451
H  1.072857 -1.915156 -0.714317
H  -2.779259 1.13924 2.217346
H  -1.160705 0.974023 3.021699
H  -4.203837 -0.739576 -0.726479
H  -3.134581 0.653224 -0.463724
H  3.176547 0.170428 0.169906
H  2.770525 -1.307064 1.082582
H  -2.318123 -1.993918 -1.876708
H  -2.700149 -0.454657 -2.697559
H  -1.253594 -0.565656 -1.669753
H  3.986759 -1.235546 -1.776209
H  4.860896 -1.67319 -0.282783
H  3.558099 -2.731066 -0.893926
