program: Gaussian 09
title: 000296158
version: EM64L-G09RevD.01
frameworkgroup: C1[X(C15H14N2O3S)]
method: RPBEPBE
basis: SDD
operation: Freq
keyword: #p
keyword: freq=noraman
keyword: PBEPBE/SDD
title: #p freq=noraman PBEPBE/SDD
converged: YES YES NO NO
title: Mulliken charges:
elementType: S O O O N N C C C C C C C C C C C C C C C H H H H H H H H H H H H H H
charge: 0.949413 -0.537444 -0.536813 -0.221118 -0.060355 -0.717543 -0.055088 -0.223749 -0.209646 0.304448 0.277868 -0.324072 -0.350011 0.445657 -0.319256 -0.343285 -0.423667 -0.360300 0.089629 -0.804186 -0.351995 0.285949 0.286768 0.263266 0.265569 0.298049 0.275991 0.234488 0.235688 0.234502 0.228976 0.239028 0.249487 0.336634 0.337116
chargesum: 0.00000
title: Mulliken charges with hydrogens summed into heavy atoms:
elementType: S O O O N N C C C C C C C C C C C C C C C
charge: 0.949413 -0.537444 -0.536813 -0.221118 -0.060355 -0.043793 -0.055088 0.062199 0.077123 0.304448 0.277868 -0.060806 -0.084441 0.445657 -0.021207 -0.067295 -0.189179 -0.124611 0.089629 -0.101679 -0.102507
polarizability: 3.92159351e+02 -1.52531506e+00 2.17933005e+02 3.74066148e+00 8.91121804e+00 1.19204858e+02
1716.lowfreq: -14.8358 -2.6268 -0.0003 0.0005 0.0016 2.4046 7.6476 11.2627 25.7820
frequency: -11.7498 11.2123 25.6603 29.7063 35.2161 56.5052 91.4967 100.9110 101.6577 121.7277 136.4203 164.1854 181.3242 205.0439 253.9785 264.6959 268.3758 301.2943 330.0591 344.1094 355.7054 375.9439 401.4612 404.9654 411.7254 432.2140 462.6997 480.7974 524.5901 542.3612 573.3526 617.3458 631.2877 653.0237 667.9348 692.9713 733.0242 745.8728 793.5717 799.1539 804.0397 822.1293 836.8097 848.0933 857.4148 866.1394 907.1896 965.8145 977.7972 984.9609 986.7160 992.8941 1001.0096 1005.9427 1012.8900 1046.9734 1050.9622 1059.9523 1069.5257 1113.9783 1124.6072 1168.8254 1193.7466 1198.0356 1224.4369 1286.4321 1293.9587 1311.0632 1334.5252 1371.3319 1375.1799 1397.2356 1401.7610 1416.6778 1461.2304 1467.0673 1470.4094 1500.0206 1521.6646 1533.3007 1572.1121 1574.9651 1582.9592 1609.0724 1619.5127 2978.4814 2982.2079 3057.2205 3090.3323 3126.2700 3130.5412 3146.3575 3157.0616 3158.6709 3165.1751 3173.7410 3176.1236 3365.9318 3533.5214
redmass: 5.7004 1.0393 3.7507 4.7300 4.7646 6.0539 6.8070 4.0271 1.6783 6.0880 4.7830 4.4963 5.7515 7.0105 6.3423 2.8879 3.7155 9.1863 7.3290 3.1143 6.6084 6.4719 4.0002 3.2771 3.0909 9.0761 3.7251 3.0600 4.6082 3.8831 5.5477 6.8958 7.0135 6.6860 3.8562 4.4903 3.3328 2.9901 2.1441 5.8200 4.0769 5.0216 1.2799 1.4825 1.6709 1.2574 3.9990 1.3659 1.4388 1.5297 1.8698 2.4584 1.4153 1.3698 3.1857 1.5988 2.5814 3.8216 1.4950 1.3105 1.3036 1.3475 1.2399 2.0518 2.9178 1.4778 2.9316 1.3336 1.3853 4.2790 5.6332 1.2506 3.8223 3.7913 2.2957 1.0725 1.1104 2.6311 6.1168 1.0852 6.6137 6.5510 7.6811 7.6664 6.2959 1.0379 1.0878 1.0964 1.0992 1.0891 1.0904 1.0883 1.0887 1.0951 1.0969 1.0951 1.0976 1.0414 1.1002
irintensity: 0.5265 0.5543 1.6553 0.7481 1.0143 1.2328 2.3252 2.5772 39.2167 0.8831 8.7580 28.4987 2.6219 3.9998 4.4714 3.1077 1.2541 0.8404 5.5771 2.9208 8.3419 14.4239 10.3182 3.3490 20.2866 66.6187 133.9198 16.5398 55.8141 53.5612 56.4491 0.2205 1.2789 7.0461 10.3947 35.3062 5.8793 5.4089 43.7873 59.7727 75.3521 127.1230 3.8793 92.6290 28.4908 0.3846 59.6244 0.1692 2.8807 9.3018 6.0643 14.8358 1.2597 0.2450 9.7455 17.4945 31.4348 8.5434 31.1342 3.7522 7.8638 6.9568 61.2698 27.0923 0.4142 78.9294 225.9577 15.0863 1.8894 3.4754 2.1123 19.6544 16.7970 17.5431 52.2587 16.2740 20.3751 7.0709 191.5672 20.5107 25.1387 2.8948 5.6945 14.5521 106.0169 25.3434 42.2587 17.1771 16.1612 17.9617 13.5721 1.6923 1.5009 9.0349 2.7543 19.1743 3.0164 32.4512 25.8427
temp: 298.150 k
press: 1.00000 atm
elementType: 16 8 8 8 7 7 6 6 6 6 6 6 6 6 6 6 6 6 6 6 6 1 1 1 1 1 1 1 1 1 1 1 1 1 1
symmnumber: 1
zpe: 674613.6 jmol-1
zpe.correction: 0.256947 hartree
zpe.thermalcorrener: 0.277167 hartree
zpe.thermalcorrenthalpy: 0.278111 hartree
zpe.thermalcorrgfe: 0.204463 hartree
zpe.sumelectzpe: -1311.536913 hartree
zpe.sumelectthermal: -1311.516692 hartree
zpe.sumelectthermalent: -1311.515748 hartree
zpe.sumelectthermalfe: -1311.589396 hartree
dipole: -3.5601 -3.9647 2.6171
dipole: 5.9365
quadrupole: -128.3703 -130.8669 -132.9699
quadrupole: 3.6016 16.5702 1.0374
quadrupole: 2.3654 -0.1312 -2.2342 3.6016 16.5702 1.0374
hfenergy: -1311.7938593 hartree
pointgroup: C01 [X(C15H14N2O3S1)]
dipole: -1.4131388 -1.3519377 1.2768456 debye
polarizability: 392.0725139|-1.003117|217.9593298|6.2056917|-8.7926011|119.2653709 unknown
InChI: InChI=1S/C15H14N2O3S/c1-11-2-4-12(5-3-11)15(18)10-17-13-6-8-14(9-7-13)21(16,19)20/h2-10H,16H2,1H3
charge 0 multiplicity 1
35 atoms
S  5.766272 -0.364994 0.00176
O  6.173124 -1.496343 -1.096994
O  6.425836 1.123398 0.056554
O  -2.70491 2.819377 -0.84115
N  -0.27871 0.263315 -0.244389
N  6.050715 -1.125164 1.654988
C  3.899238 -0.153449 -0.06357
C  3.354749 1.056106 0.396426
C  3.129658 -1.208746 -0.582301
C  1.138629 0.174475 -0.192003
C  -3.39134 0.58048 -0.251582
C  1.957509 1.220904 0.324863
C  1.732824 -1.042372 -0.627891
C  -5.487214 -1.290451 0.304455
C  -3.085609 -0.764301 0.099319
C  -4.760314 0.975169 -0.320006
C  -4.124279 -1.678312 0.371466
C  -5.785343 0.0565 -0.048542
C  -2.368438 1.619837 -0.557594
C  -6.601511 -2.273139 0.607417
C  -0.877744 1.379044 -0.56394
H  4.0077 1.848131 0.776664
H  3.611915 -2.120202 -0.94873
H  1.497834 2.142812 0.696656
H  1.084698 -1.83682 -1.008937
H  -2.039887 -1.074841 0.156587
H  -4.985188 2.012089 -0.591232
H  -3.874628 -2.711368 0.640972
H  -6.832634 0.376628 -0.108532
H  -7.358499 -2.281681 -0.198358
H  -6.218121 -3.300207 0.728263
H  -7.128745 -1.998233 1.541171
H  -0.330278 2.288255 -0.889253
H  6.631276 -0.474958 2.210666
H  6.496311 -2.046439 1.508883
