program: Gaussian 09
title: 000296132
version: EM64L-G09RevD.01
frameworkgroup: C1[X(C6H14N4O2)]
method: RPBEPBE
basis: SDD
operation: Freq
keyword: #p
keyword: freq=noraman
keyword: PBEPBE/SDD
title: #p freq=noraman PBEPBE/SDD
converged: YES YES NO NO
title: Mulliken charges:
elementType: O O N N N N C C C C C C H H H H H H H H H H H H H H
charge: -0.371142 -0.371120 -0.142454 -0.142453 -0.359748 -0.359724 0.337923 0.337867 -0.624948 -0.644959 -0.624947 -0.644987 0.360198 0.360223 0.284072 0.222147 0.222943 0.235723 0.238617 0.241637 0.222934 0.284070 0.222150 0.241644 0.235721 0.238616
chargesum: 0.00000
title: Mulliken charges with hydrogens summed into heavy atoms:
elementType: O O N N N N C C C C C C
charge: -0.371142 -0.371120 -0.142454 -0.142453 0.000450 0.000499 0.337923 0.337867 0.104213 0.071017 0.104206 0.070994
polarizability: 1.55352347e+02 2.87373507e+00 1.01642356e+02 -1.71696750e-04 2.26042933e-03 6.43897537e+01
1716.lowfreq: -8.0553 -7.0884 0.0006 0.0007 0.0008 5.4058 22.7922 50.2068 71.6038
frequency: 22.7871 50.2025 71.5010 92.2156 97.9658 130.0433 133.6670 142.6004 152.7620 189.3346 206.2927 219.7389 249.8367 259.6001 318.6861 369.1734 378.9490 442.1582 485.6458 494.0751 577.7585 604.8121 607.8615 675.2608 702.6829 805.7470 897.9662 999.9973 1004.1598 1062.8817 1063.5912 1097.4520 1097.5772 1130.2414 1136.6532 1140.2114 1183.2538 1239.5914 1257.0350 1283.4065 1302.1933 1374.3907 1415.9914 1420.5860 1422.5308 1447.6594 1455.5034 1476.0483 1476.1409 1484.7903 1487.7031 1488.4638 1490.4393 1500.9156 1503.0408 1540.4956 1572.4434 1607.1475 2945.7474 2945.8676 2961.6901 2962.5699 3028.4576 3028.6002 3034.5330 3034.5995 3092.2870 3092.4100 3113.6466 3113.6655 3492.2460 3505.6764
redmass: 3.8882 3.1555 2.8150 2.6094 1.5183 1.6079 2.5673 1.3602 1.4092 1.6955 2.3743 2.4088 6.2490 4.7864 3.8740 3.6892 2.4927 2.6366 1.2580 1.3628 4.7653 4.1704 4.0110 11.5578 5.5028 5.9136 4.1032 2.9018 2.2449 1.4005 1.3997 1.2343 1.2346 2.0740 1.3421 1.5571 1.5305 3.2598 5.0179 3.6307 2.1029 2.2327 1.5024 1.1599 1.2674 1.1561 1.4515 1.0484 1.0452 1.0717 1.0574 1.0496 1.0967 1.3975 1.1116 4.4972 5.4493 4.2735 1.0408 1.0408 1.0370 1.0371 1.0959 1.0959 1.1019 1.1019 1.0973 1.0973 1.0965 1.0965 1.0779 1.0792
irintensity: 0.0008 5.9294 8.0594 5.9916 10.9302 2.4394 2.0892 2.1295 1.8382 0.5905 3.7497 0.0012 3.6161 1.6970 63.2963 1.8103 9.5110 53.0760 175.3540 8.4740 12.1922 3.1100 20.0863 44.5034 3.2821 6.7787 0.6100 3.9682 141.4090 26.5980 0.5191 0.0825 2.5462 0.5937 7.7156 0.0134 60.8702 0.5406 38.1457 0.0116 70.6932 2.8480 397.6545 1.9088 308.2446 0.0872 425.0466 3.3364 35.0925 11.6529 14.1452 7.0366 5.7880 304.0930 3.0572 3.2872 619.4604 0.2860 101.2799 4.6566 201.2605 10.1346 3.1624 65.4306 8.9382 81.4810 36.7509 0.7986 0.9476 1.9148 0.4789 218.2843
temp: 298.150 k
press: 1.00000 atm
elementType: 8 8 7 7 7 7 6 6 6 6 6 6 1 1 1 1 1 1 1 1 1 1 1 1 1 1
symmnumber: 1
zpe: 561610.0 jmol-1
zpe.correction: 0.213906 hartree
zpe.thermalcorrener: 0.229071 hartree
zpe.thermalcorrenthalpy: 0.230015 hartree
zpe.thermalcorrgfe: 0.170628 hartree
zpe.sumelectzpe: -605.515045 hartree
zpe.sumelectthermal: -605.499880 hartree
zpe.sumelectthermalent: -605.498936 hartree
zpe.sumelectthermalfe: -605.558323 hartree
dipole: 0.0013 -0.0004 0.1867
dipole: 0.1867
quadrupole: -49.2545 -78.5685 -74.4361
quadrupole: 15.1343 0.0005 -0.0010
quadrupole: 18.1652 -11.1488 -7.0164 15.1343 0.0005 -0.0010
hfenergy: -605.7289513 hartree
pointgroup: C01 [X(C6H14N4O2)]
dipole: 0.0005562 -0.0005759 0.0734567 debye
dipolederiv: -0.7994295 -0.1186965 0.0024881 0.0581849 -1.1366332 0.0577359 -0.0108464 0.0510321 -0.4109756 -0.7993456 -0.1186746 -0.0032007 0.0581312 -1.1353629 -0.0661151 0.0122015 -0.0591759 -0.4123537 -1.4819482 -0.256729 -0.0522391 -0.3436104 -0.6781521 -0.0196711 0.0166488 0.0514059 -0.3504881 -1.4817494 -0.2574845 0.051143 -0.3434371 -0.6778867 0.016405 -0.0188768 -0.0547224 -0.350936 -1.009486 0.217643 -0.0088372 0.8090757 -0.4241396 0.1200322 -0.2264481 0.1125075 -0.348644 -1.0093203 0.217354 0.0124655 0.8062563 -0.4213514 -0.1221198 0.2368471 -0.113653 -0.3517439 2.3710421 0.2009531 0.1033663 -0.1574403 1.3834901 -0.0981335 0.1456149 -0.0837504 0.2982685 2.3705267 0.2023479 -0.104469 -0.1555133 1.3814309 0.1108175 -0.1508863 0.0958797 0.3009494 0.5709294 -0.1383663 0.0590839 -0.357342 0.023968 -0.0000225 0.0667563 -0.0038633 0.2837656 0.0236739 -0.0080851 -0.0218512 0.2051973 0.4782984 0.0502213 -0.0711253 0.0211146 0.2665049 0.5708217 -0.1375594 -0.0611595 -0.3564213 0.0238567 -0.0022803 -0.0712919 0.0012332 0.2840219 0.0237846 -0.0085732 0.0221572 0.2040604 0.4790414 -0.0480419 0.0738792 -0.0185874 0.2655957 0.3423625 0.0476126 -0.014545 -0.1793763 0.1973843 -0.0162636 -0.0111892 -0.0399743 0.3371719 0.3425647 0.0474991 0.0150652 -0.1795661 0.1967527 0.0149268 0.0090984 0.0382862 0.3377291 0.1940167 -0.0641873 0.0067067 0.0401069 -0.0231682 0.0230755 0.0009346 0.0081668 0.1288399 -0.0952387 0.0167512 -0.0852729 -0.0114673 0.0839848 -0.1005626 -0.1747185 -0.054078 -0.1166637 -0.1568949 0.0242711 0.0874496 -0.0153609 0.1048126 0.050784 0.1581476 0.0201214 -0.0660586 -0.1300401 -0.0958642 0.0575879 -0.03406 0.067525 -0.0069879 0.0467063 0.0073803 0.1115976 0.0943883 0.0681142 0.0648382 -0.0376396 -0.0857456 -0.0595088 0.0332753 -0.1362226 -0.0957855 0.076519 0.1061492 -0.1256238 0.0243381 0.0081791 0.0228923 -0.0779175 0.0566679 -0.0372796 -0.1573 0.0251216 -0.0870192 -0.0138187 0.1055953 -0.0489009 -0.1581149 -0.0183332 -0.0663813 0.1940301 -0.0640802 -0.0074765 0.0401386 -0.0228209 -0.0247745 -0.0005284 -0.0097255 0.1284764 -0.0948126 0.0158755 0.0853747 -0.0132376 0.0822456 0.1027866 0.174568 0.0562657 -0.1154166 0.0769165 0.1046209 0.1265918 0.0233838 0.0090443 -0.0223984 0.0779712 -0.0563705 -0.0386664 -0.130189 -0.0952663 -0.0581284 -0.0335592 0.0675388 0.0065092 -0.0465472 -0.0077063 0.1118253 0.0941782 0.0692532 -0.0644953 -0.0370231 -0.0878874 0.0595944 -0.0341585 0.1361014 -0.0933532 unknown
polarizability: 155.1692448|4.2495952|101.824212|-0.0479773|0.2108939|64.390999 unknown
InChI: InChI=1S/C6H14N4O2/c1-9(2)5(11)7-8-6(12)10(3)4/h7-8H,1-4H3
charge 0 multiplicity 1
26 atoms
O  1.623835 -1.708078 -0.014201
O  -1.63467 1.724716 0.008005
N  2.959705 0.241611 -0.08439
N  -2.97028 -0.22435 -0.082422
N  0.611864 0.352081 -0.301376
N  -0.62281 -0.331844 -0.304434
C  1.744311 -0.434105 -0.115685
C  -1.75507 0.451973 -0.107928
C  4.183922 -0.522135 0.192282
C  3.046772 1.699719 -0.235291
C  -4.19423 0.53592 0.204808
C  -3.057178 -1.680688 -0.249521
H  0.491933 1.362114 -0.174055
H  -0.502602 -1.34327 -0.188919
H  3.911085 -1.585736 0.271137
H  4.652864 -0.19901 1.142516
H  4.918267 -0.398393 -0.626847
H  4.09182 1.976286 -0.450836
H  2.733012 2.244918 0.679575
H  2.429904 2.048254 -1.085335
H  -4.929991 0.420889 -0.614315
H  -3.921561 1.598679 0.294794
H  -4.661349 0.202268 1.152298
H  -2.442076 -2.019411 -1.104804
H  -4.102601 -1.955218 -0.465828
H  -2.741177 -2.235992 0.658474
