program: Gaussian 09
title: 000296114
version: EM64L-G09RevD.01
frameworkgroup: C1[X(C11H8ClN5)]
method: RPBEPBE
basis: SDD
operation: Freq
keyword: #p
keyword: freq=noraman
keyword: PBEPBE/SDD
title: #p freq=noraman PBEPBE/SDD
converged: NO NO NO NO
title: Mulliken charges:
elementType: Cl N N N N N C C C C C C C C C C C H H H H H H H H
charge: -0.061278 0.081732 -0.392880 0.030538 -0.032183 -0.640435 -0.143550 0.047853 -0.148451 0.344028 0.293342 -0.422393 -0.364215 -0.364175 -0.205530 -0.205480 -0.097299 0.259285 0.336187 0.248169 0.248196 0.256305 0.256308 0.354790 0.321136
chargesum: 0.00000
title: Mulliken charges with hydrogens summed into heavy atoms:
elementType: Cl N N N N N C C C C C C C C C C C
charge: -0.061278 0.081732 -0.056693 0.030538 -0.032183 0.035491 -0.143550 0.047853 -0.148451 0.344028 0.293342 -0.163108 -0.116046 -0.115979 0.050775 0.050828 -0.097299
polarizability: 2.86172498e+02 2.30471328e+00 1.16861841e+02 2.47263653e-03 -6.03765614e-02 1.04318770e+02
1716.lowfreq: -62.6966 -3.8777 -1.2657 0.0022 0.0026 0.0029 10.9939 42.2553 43.7480
frequency: -62.6862 42.2425 43.7456 146.5033 149.2411 196.4571 199.7735 238.2566 250.1680 261.5522 316.0510 360.4051 398.7245 422.0274 436.8881 450.1473 472.9593 503.8792 543.9701 585.5907 604.9455 616.6579 626.4968 635.0760 694.7118 705.9167 720.2697 737.5547 775.6674 805.9249 828.5706 831.0791 890.6214 913.8944 950.0899 964.7265 998.1691 1000.9668 1026.6567 1046.4094 1071.7984 1105.6759 1134.6609 1185.0694 1231.3617 1273.4672 1291.7867 1316.9956 1325.8996 1352.6467 1386.7773 1395.7067 1396.5348 1432.9488 1473.8507 1510.9697 1521.6819 1577.8178 1601.6255 1608.8907 1651.7593 3142.7218 3143.6649 3151.6462 3168.2045 3171.6622 3555.5488 3608.0544 3697.7828
redmass: 4.3921 6.8926 9.6895 7.3525 6.9393 7.3347 3.1706 1.2636 4.9835 6.2480 5.7920 5.5315 2.8878 7.9635 9.3756 1.2329 6.8452 3.5505 5.7585 6.5858 5.8882 6.3342 3.3713 1.4825 4.6261 7.5298 3.8943 6.9784 7.1485 8.7636 1.2457 1.6308 1.4598 6.8034 1.3604 1.3720 3.8739 2.6272 3.4339 4.6961 2.3892 1.3679 6.3185 1.1196 2.8735 4.7525 1.2514 1.7540 6.8582 5.4886 3.6078 1.8502 3.7245 6.7868 2.8174 6.3979 6.7711 7.6725 5.9751 1.4045 3.3834 1.0894 1.0893 1.0925 1.0960 1.0972 1.0453 1.0817 1.1046
irintensity: 0.5520 2.2710 0.8757 2.8059 4.1165 0.9864 37.0865 59.5916 2.0442 2.3911 0.0870 1.8980 0.0512 9.8803 14.8831 171.3067 43.7372 7.6434 21.3465 5.3865 14.3787 3.7625 43.0252 88.4097 7.3810 5.4508 3.9968 3.1234 2.3668 0.2400 0.0110 56.5154 11.5981 36.2126 1.1193 0.0635 62.9867 16.2995 56.8298 2.7394 52.5230 8.3984 25.2319 1.4055 75.7010 40.3973 0.3265 52.8232 5.7131 0.6217 5.3112 30.9156 0.0481 1.4721 74.5255 26.2201 65.7249 1.4180 20.7865 4.0895 525.8301 4.2295 5.9689 7.2186 7.3107 0.5225 123.0845 94.5603 47.5399
temp: 298.150 k
press: 1.00000 atm
elementType: 17 7 7 7 7 7 6 6 6 6 6 6 6 6 6 6 6 1 1 1 1 1 1 1 1
symmnumber: 1
zpe: 465827.0 jmol-1
zpe.correction: 0.177424 hartree
zpe.thermalcorrener: 0.190429 hartree
zpe.thermalcorrenthalpy: 0.191373 hartree
zpe.thermalcorrgfe: 0.137109 hartree
zpe.sumelectzpe: -1156.584808 hartree
zpe.sumelectthermal: -1156.571803 hartree
zpe.sumelectthermalent: -1156.570859 hartree
zpe.sumelectthermalfe: -1156.625123 hartree
dipole: 6.9072 -2.9648 -0.0093
dipole: 7.5167
quadrupole: -64.6819 -113.6553 -98.8121
quadrupole: -4.0564 -0.0147 -0.0676
quadrupole: 27.7012 -21.2722 -6.4290 -4.0564 -0.0147 -0.0676
hfenergy: -1156.7622324 hartree
pointgroup: C01 [X(C11H8Cl1N5)]
dipole: 2.7187884 1.1634944 -0.0017794 debye
dipolederiv: -0.9798967 -0.0178484 0.0000589 -0.0211875 -0.0751703 0.0000334 0.0000858 0.0000274 -0.1324382 -0.4255173 0.0324034 -0.0000155 0.0547797 -0.2623981 0.0000262 0.0001646 -0.0000208 -0.2271951 -0.3207885 0.4403752 -0.0007855 0.1884389 -0.1518562 -0.000187 -0.0002903 -0.0001828 -0.2540274 0.2966702 -0.0101166 0.0000778 -0.5803197 -0.2739586 0.0000701 0.0010332 0.0000819 -0.2164724 -0.446057 -0.1333511 0.0002293 0.3902844 -0.3983845 0.000307 -0.0008086 0.0003336 -0.2218643 -1.2719503 -0.5811625 0.0010745 -0.8165565 -0.662981 -0.0000717 0.0016086 -0.0000187 -0.6828479 -0.588742 -0.4349282 0.000748 0.8069876 -0.1773353 0.0003698 -0.0013723 0.0003715 0.0202578 0.9406589 -0.0230495 -0.0000233 0.3538481 0.2148176 -0.0000794 -0.0006048 -0.0001968 0.05143 0.2164769 -0.0022339 0.0000139 -0.7456023 0.2728248 -0.000282 0.0009951 -0.0001895 0.1308476 0.1454288 0.0271528 0.0000521 -0.0663861 -0.0606632 0.0000287 -0.0001582 0.0000145 -0.0606719 1.7160434 0.6390376 -0.0011333 0.5226842 0.6769019 -0.0009549 -0.0009902 -0.0009735 0.1412762 -0.6411989 -0.0649878 0.0000431 -0.2326574 0.1423379 -0.0002551 0.0005703 -0.0002807 -0.041888 -0.0708049 0.0019415 -0.0536174 -0.0186871 -0.1128497 0.0146926 0.1096044 -0.0078141 0.0867929 -0.0709085 0.0019477 0.053669 -0.0177078 -0.1127793 -0.0150599 -0.1095438 0.0076973 0.086764 -0.3702735 -0.0012732 0.0771698 -0.0005003 -0.1035946 0.0055356 0.0496628 0.0035023 -0.006669 -0.3700867 -0.0011735 -0.0772021 -0.0007576 -0.1035217 -0.0056079 -0.0494119 -0.003636 -0.0066043 1.3838739 0.0271737 -0.0000855 0.032517 -0.0654358 -0.0001211 -0.0003024 -0.000146 0.1246984 0.0411262 0.0824257 -0.0001828 0.1172714 -0.007832 0.0001858 -0.0001822 0.0002477 0.1180517 0.2120047 -0.0476741 0.0000844 -0.0645976 0.2556115 0.0001618 0.0001654 0.0001602 0.3418411 0.0528787 -0.0046897 0.0850054 0.000732 0.1379986 -0.0006943 0.0907901 0.0019278 -0.0213118 0.0528662 -0.0045611 -0.0849809 0.0008058 0.1380006 0.0009764 -0.0907102 -0.0018 -0.0211986 0.0258973 -0.001629 -0.068863 -0.0007321 0.1635432 -0.0008558 -0.0681157 -0.0015898 -0.0032024 0.02592 -0.0017015 0.0688441 -0.0008965 0.1635369 0.0010536 0.0681122 0.0017899 -0.0032197 0.1937208 0.0271085 -0.000068 0.1076004 0.2519792 0.0002531 -0.0002214 0.000239 0.3908517 0.2526582 0.050814 -0.0001129 -0.009361 0.151208 0.0004749 -0.0000803 0.0004556 0.4067998 unknown
polarizability: 286.1672637|-2.4895496|116.866239|0.0092606|-0.1188917|104.319606 unknown
InChI: InChI=1S/C11H8ClN5/c12-7-3-1-6(2-4-7)8-5-14-9-10(13)16-17-11(9)15-8/h1-5,16H,13H2
charge 0 multiplicity 1
25 atoms
Cl -6.179414 -0.059367 0.000311
N  0.651714 -1.046611 0.001865
N  4.164321 -1.191391 0.002301
N  1.944871 1.595122 -0.002776
N  2.943131 -1.915424 0.003598
N  5.079892 1.092767 -0.001812
C  2.647207 0.418589 -0.000649
C  -0.036824 0.119356 -0.000267
C  2.024853 -0.897303 0.001671
C  -1.536597 0.058541 -0.00014
C  4.049481 0.182395 -0.000181
C  0.603721 1.426824 -0.002554
C  -2.25614 0.040957 -1.221357
C  -2.255863 0.039456 1.221219
C  -3.668283 0.003023 -1.230485
C  -3.668003 0.001541 1.23062
C  -4.352024 -0.014105 0.000135
H  -0.016468 2.328292 -0.004126
H  5.021177 -1.741442 0.003317
H  -1.714623 0.045908 -2.173511
H  -1.714117 0.043212 2.173246
H  -4.221727 -0.015392 -2.174074
H  -4.221234 -0.017991 2.174312
H  4.834168 2.080496 -0.003576
H  6.06008 0.826444 -0.001189
