program: Gaussian 09
title: 000296159
version: EM64L-G09RevD.01
frameworkgroup: C1[X(C16H14N2O4)]
method: RPBEPBE
basis: SDD
operation: Freq
keyword: #p
keyword: freq=noraman
keyword: PBEPBE/SDD
title: #p freq=noraman PBEPBE/SDD
converged: YES YES NO NO
title: Mulliken charges:
elementType: O O O O N N C C C C C C C C C C C C C C C C H H H H H H H H H H H H H H
charge: -0.253135 -0.226626 -0.202480 -0.202293 -0.020262 0.019718 0.300033 0.204432 0.441682 0.261720 -0.320056 -0.347346 0.361117 -0.483340 -0.433340 -0.360630 -0.319637 -0.358689 0.084580 -0.805166 -0.341865 -0.535399 0.306302 0.308394 0.271597 0.241365 0.233458 0.261743 0.253904 0.233570 0.230831 0.235851 0.251916 0.255435 0.226116 0.226502
chargesum: 0.00000
title: Mulliken charges with hydrogens summed into heavy atoms:
elementType: O O O O N N C C C C C C C C C C C C C C C C
charge: -0.253135 -0.226626 -0.202480 -0.202293 -0.020262 0.019718 0.300033 0.204432 0.441682 0.261720 -0.011662 -0.075749 0.361117 -0.177038 -0.191975 -0.127172 -0.057894 -0.104786 0.084580 -0.104915 -0.089949 0.172654
polarizability: 3.82320418e+02 -3.28659044e+00 2.35343144e+02 4.54993230e+00 4.49298153e+00 1.02407920e+02
1716.lowfreq: -8.8985 -6.1015 -4.6643 0.0004 0.0006 0.0008 4.2775 18.2747 32.8727
frequency: -8.5463 18.2495 32.8386 47.6186 63.3217 71.7104 89.4345 92.4297 109.7849 140.5159 150.5679 180.7581 198.3842 203.6969 233.7123 261.8754 271.7702 313.4993 339.6698 343.4167 365.8168 388.1006 404.3371 415.2690 438.9015 477.4264 515.1377 521.9149 555.6527 589.6093 604.3410 635.5060 650.7983 662.7514 682.7445 698.1223 723.6950 735.1518 746.8121 791.5016 803.9001 819.6972 850.8531 862.7918 883.0218 905.3691 938.9372 959.5043 985.3759 990.1126 997.7316 1000.9518 1010.9797 1047.1501 1053.4566 1063.2519 1112.6395 1128.9142 1138.0062 1165.0748 1189.9871 1199.6078 1216.8803 1222.2626 1225.8418 1264.5939 1298.8970 1316.8108 1333.7210 1351.4945 1365.0656 1372.0374 1396.3877 1416.5528 1434.4164 1436.6648 1468.0395 1468.3533 1469.4208 1470.5388 1481.1958 1503.3039 1525.9855 1552.5335 1573.9441 1602.8051 1618.8804 1623.2786 2966.7123 2977.8575 2986.6143 3055.0079 3058.4828 3091.2410 3123.9228 3135.7305 3136.4975 3147.4487 3156.7425 3171.4052 3186.2017 3191.1085
redmass: 1.0490 5.7180 5.6978 4.9211 4.7014 10.2893 4.7352 4.0373 5.1129 5.7237 4.6545 4.3265 4.0158 2.6788 1.6962 4.1979 3.9714 5.5928 9.5485 3.0807 6.6263 5.6553 2.9155 6.1276 4.0956 3.0374 5.7232 5.6790 4.1047 5.1609 5.9218 6.8992 3.7728 7.5985 5.6232 4.3708 6.3258 4.6778 3.6120 4.7408 3.6634 1.7249 1.6355 1.2469 7.0221 1.5363 1.3503 1.6600 1.4476 1.3689 1.3958 4.3596 3.0306 1.5929 3.3801 3.8199 1.2575 1.3155 1.4544 1.3759 2.5469 1.1813 4.6592 3.4397 2.9509 1.7738 4.1730 1.2862 1.6113 4.7192 7.0596 4.3810 1.2564 3.6759 2.3645 1.6264 1.1134 1.0505 1.0687 1.1260 2.4001 2.5875 6.6032 8.3955 6.1719 8.8187 6.2194 7.2819 1.0330 1.0377 1.0878 1.0969 1.1045 1.0987 1.0889 1.0996 1.0908 1.0886 1.0953 1.0955 1.0947 1.0924
irintensity: 0.9812 4.1053 2.0870 2.9835 0.4003 0.3978 1.8144 2.9880 4.4697 6.9947 2.8861 11.6070 16.7558 2.6228 1.4568 27.8959 1.1571 2.9752 0.7458 5.2329 2.6523 1.7528 0.4197 2.3820 4.8069 12.5825 9.3581 38.2571 18.9770 2.6895 14.6760 1.6509 8.8738 4.0177 1.7648 13.0286 21.3083 30.3646 12.2798 33.4510 25.7507 44.5401 42.6325 1.6467 12.3385 26.1208 2.5625 23.5971 5.3677 2.2965 5.2005 70.4529 8.1622 14.8968 6.4767 4.9391 0.1386 12.6948 6.9662 11.0788 84.4810 30.4294 231.1994 147.0504 0.6362 187.7566 226.9428 1.6545 4.2837 49.3298 111.2627 6.2226 20.1755 17.3432 21.3239 30.5277 108.6294 13.7767 41.5262 17.3846 163.5357 11.7927 182.0256 20.9624 25.6064 44.1325 110.2232 79.7374 70.6302 26.1246 37.7283 17.2923 41.7231 16.3073 17.8660 20.6201 13.4516 3.1996 10.3762 7.7344 21.6358 7.7092
temp: 298.150 k
press: 1.00000 atm
elementType: 8 8 8 8 7 7 6 6 6 6 6 6 6 6 6 6 6 6 6 6 6 6 1 1 1 1 1 1 1 1 1 1 1 1 1 1
symmnumber: 1
zpe: 701424.6 jmol-1
zpe.correction: 0.267159 hartree
zpe.thermalcorrener: 0.286816 hartree
zpe.thermalcorrenthalpy: 0.287760 hartree
zpe.thermalcorrgfe: 0.217019 hartree
zpe.sumelectzpe: -1026.820584 hartree
zpe.sumelectthermal: -1026.800927 hartree
zpe.sumelectthermalent: -1026.799982 hartree
zpe.sumelectthermalfe: -1026.870723 hartree
dipole: 3.5750 -2.4535 1.7549
dipole: 4.6776
quadrupole: -78.3215 -139.7958 -129.6701
quadrupole: -25.3403 -1.2379 -1.6725
quadrupole: 37.6076 -23.8666 -13.7410 -25.3403 -1.2379 -1.6725
hfenergy: -1027.0877421 hartree
pointgroup: C01 [X(C16H14N2O4)]
dipole: 1.3120387 -0.7846544 -1.0245129 debye
polarizability: 375.8666559|-42.094098|110.9194744|-5.8127306|-16.3360098|233.2853507 unknown
InChI: InChI=1S/C16H14N2O4/c1-11-3-5-12(6-4-11)16(19)10-17-14-8-7-13(22-2)9-15(14)18(20)21/h3-10H,1-2H3
charge 0 multiplicity 1
36 atoms
O  5.447329 -1.753479 0.329352
O  -2.120156 0.736894 -3.058265
O  1.618438 -0.81219 3.314758
O  0.167216 0.393436 2.032134
N  0.011219 -0.402088 -0.500133
N  1.211405 -0.356761 2.17516
C  -3.02379 0.113311 -0.898837
C  1.391455 -0.624116 -0.328755
C  -5.265202 -0.389453 0.803025
C  1.987971 -0.707042 0.971068
C  -2.845509 -0.007832 0.507549
C  -4.335492 -0.013483 -1.442686
C  4.130447 -1.395843 0.039242
C  3.326495 -1.088206 1.159807
C  -3.958899 -0.252113 1.338152
C  -5.433154 -0.266128 -0.606403
C  2.228226 -0.950514 -1.432702
C  3.573221 -1.327218 -1.265431
C  -1.914319 0.417676 -1.838806
C  -6.458727 -0.652469 1.700979
C  -0.461945 0.368567 -1.43991
C  6.337045 -2.06292 -0.796614
H  3.743377 -1.136416 2.168409
H  -1.850427 0.088589 0.947195
H  -4.45971 0.094452 -2.525539
H  -3.809811 -0.33701 2.420709
H  -6.436001 -0.368396 -1.038826
H  1.789372 -0.947149 -2.436098
H  4.17113 -1.572026 -2.147862
H  -6.996105 -1.569192 1.393569
H  -6.156349 -0.771961 2.754789
H  -7.186558 0.179641 1.649373
H  0.183171 0.993982 -2.09039
H  7.306195 -2.298765 -0.335068
H  6.445723 -1.192233 -1.471176
H  5.971817 -2.938945 -1.366071
