program: Gaussian 09
title: 000296112
version: EM64L-G09RevD.01
frameworkgroup: C1[X(C12H11N5)]
method: RPBEPBE
basis: SDD
operation: Freq
keyword: #pfreq=noraman
keyword: PBEPBE/SDD
title: #p freq=noraman PBEPBE/SDD
converged: YES YES NO NO
title: Mulliken charges:
elementType: N N N N N C C C C C C C C C C C C H H H H H H H H H H H
charge: -0.274160 -0.059300 -0.034791 0.039375 -0.638193 0.097441 -0.177157 0.404283 0.136664 0.288919 -0.366777 -0.407027 -0.443129 -0.225144 -0.204887 -0.786002 -0.252050 0.304068 0.284745 0.249566 0.223156 0.225267 0.234453 0.234360 0.252692 0.340625 0.326505 0.226498
chargesum: 0.00000
title: Mulliken charges with hydrogens summed into heavy atoms:
elementType: N N N N N C C C C C C C C C C C C
charge: -0.274160 -0.059300 -0.034791 0.039375 0.028938 0.097441 -0.177157 0.404283 0.136664 0.288919 -0.062708 -0.122283 -0.193563 -0.001988 0.020380 -0.064498 -0.025552
polarizability: 2.62456524e+02 -4.43405200e+00 1.99108806e+02 -2.84970337e-02 1.07058828e-01 6.75992858e+01
1716.lowfreq: -62.7248 -0.0005 0.0003 0.0005 6.1531 6.6682 10.8452 47.5515 70.9577
frequency: -62.6112 47.5474 70.9541 108.6205 112.6926 197.2221 201.9845 235.8958 278.8203 290.7594 313.6644 372.8863 388.8463 410.3824 413.0954 434.8805 465.5935 481.0947 519.0283 592.7879 613.3252 617.1189 617.3811 658.2409 661.7423 696.6501 702.6452 742.9526 768.8614 803.3295 857.3710 872.0154 888.7487 932.5807 959.0347 978.3806 986.2708 988.9691 999.4003 1025.4310 1034.6090 1045.3743 1079.6760 1096.5923 1107.4258 1170.6364 1188.6025 1220.2562 1263.3630 1278.4094 1314.7659 1325.8876 1382.7478 1391.2425 1395.1514 1420.4316 1435.4620 1452.9088 1465.2551 1473.1922 1498.2449 1509.0711 1534.8428 1576.5103 1593.3703 1613.1910 1632.6043 2986.3512 3064.6325 3117.3725 3127.8148 3139.1553 3148.2798 3159.7219 3176.2180 3190.2366 3565.1786 3712.9950
redmass: 1.0187 3.8155 5.9724 3.9366 4.6290 5.3281 3.4099 5.9022 3.9564 3.5683 5.9229 3.9615 2.8868 1.7065 1.9988 1.3602 5.5781 5.4683 3.4082 6.8069 5.6896 6.1932 6.8690 4.5827 6.8472 6.4412 2.0821 7.3534 1.6347 10.0351 1.2452 6.8953 1.3231 1.4123 2.8005 2.2697 6.1995 1.3479 1.2948 2.2891 3.0260 1.5782 1.8694 3.1106 2.7595 1.0548 1.1310 4.0281 2.7793 3.5709 5.7371 1.3725 5.3269 1.3393 2.9383 5.6879 2.4029 1.8507 1.0459 1.8028 3.0231 6.2772 6.7661 1.9129 6.5222 5.6922 2.2950 1.0381 1.0973 1.0983 1.0852 1.0907 1.0923 1.0968 1.0964 1.0948 1.0443 1.1054
irintensity: 0.4510 0.0728 1.7418 3.3015 0.5556 1.1653 5.3019 0.8755 2.1823 0.0394 6.5181 0.5042 5.7349 161.4398 103.8951 8.3412 53.3466 5.8185 8.1766 5.9865 1.0652 1.2322 1.1139 10.8746 27.2046 3.8169 39.7418 9.4465 74.4745 1.2135 0.0002 9.5582 13.9505 10.5757 6.9284 8.8921 2.5239 0.1758 2.1521 9.1423 17.5132 8.8830 1.0723 9.3375 16.5586 0.2568 1.2642 39.9857 40.9928 17.5859 24.1993 0.8127 10.4866 69.0493 63.6472 110.1602 3.9868 22.1670 16.1130 8.0949 149.3194 96.6118 74.0491 64.4727 4.1097 126.4419 475.5721 17.2737 15.5110 8.1125 0.2409 25.4427 13.9319 29.2775 15.5005 3.4093 118.8673 44.6923
temp: 298.150 k
press: 1.00000 atm
elementType: 7 7 7 7 7 6 6 6 6 6 6 6 6 6 6 6 6 1 1 1 1 1 1 1 1 1 1 1
symmnumber: 1
zpe: 563411.1 jmol-1
zpe.correction: 0.214592 hartree
zpe.thermalcorrener: 0.227768 hartree
zpe.thermalcorrenthalpy: 0.228712 hartree
zpe.thermalcorrgfe: 0.174737 hartree
zpe.sumelectzpe: -736.442788 hartree
zpe.sumelectthermal: -736.429612 hartree
zpe.sumelectthermalent: -736.428668 hartree
zpe.sumelectthermalfe: -736.482643 hartree
dipole: 1.9481 0.0320 -0.0052
dipole: 1.9483
quadrupole: -87.3664 -79.3887 -103.8642
quadrupole: -1.0708 -0.0200 0.0051
quadrupole: 2.8400 10.8178 -13.6578 -1.0708 -0.0200 0.0051
hfenergy: -736.65738 hartree
pointgroup: C01 [X(C12H11N5)]
dipole: 0.7660652 0.0268637 0.000707 debye
polarizability: 261.833832|7.6554348|199.5989542|-0.3485964|-4.1833136|67.7318303 unknown
InChI: InChI=1S/C12H11N5/c1-8-7-14-10-11(13)16-17(12(10)15-8)9-5-3-2-4-6-9/h2-7H,13H2,1H3
charge 0 multiplicity 1
28 atoms
N  -0.33689 -0.575663 0.039391
N  -0.056863 -1.982902 0.08646
N  1.036131 1.505906 -0.02898
N  3.226623 -0.417148 0.032704
N  1.956222 -3.29954 0.129506
C  0.837985 0.15444 0.016093
C  1.920483 -0.792023 0.046245
C  -1.700515 -0.154312 0.026533
C  1.295429 -2.095878 0.089805
C  2.349392 1.886612 -0.042979
C  -2.025907 1.227263 -0.012263
C  -2.725519 -1.133964 0.053567
C  3.423616 0.929754 -0.012099
C  -3.382439 1.613875 -0.023245
C  -4.074713 -0.725624 0.041941
C  2.643541 3.367908 -0.093049
C  -4.41409 0.647106 0.003651
H  -1.226461 1.971468 -0.033343
H  -2.448319 -2.189579 0.083413
H  4.461893 1.275645 -0.02447
H  -3.631845 2.680557 -0.053321
H  -4.86403 -1.48539 0.063124
H  3.229476 3.690465 0.787599
H  3.232518 3.629618 -0.991652
H  1.699283 3.933317 -0.113926
H  2.972274 -3.304089 0.13055
H  1.438423 -4.173017 0.159812
H  -5.464399 0.957789 -0.005165
