program: Gaussian 09
title: 000296097
version: EM64L-G09RevD.01
frameworkgroup: C1[X(C11H16O)]
method: RPBEPBE
basis: SDD
operation: Freq
keyword: #pfreq=noraman
keyword: PBEPBE/SDD
title: #p freq=noraman PBEPBE/SDD
converged: YES YES NO NO
title: Mulliken charges:
elementType: O C C C C C C C C C C C H H H H H H H H H H H H H H H H
charge: -0.207859 -0.062801 -0.124976 -0.495856 -0.520157 -0.126120 -0.486045 -0.470438 -0.220410 -0.205497 0.173440 -0.789751 0.207944 0.206234 0.201879 0.213702 0.254849 0.203383 0.229133 0.208294 0.240610 0.217060 0.204931 0.218157 0.200390 0.235121 0.240714 0.254069
chargesum: 0.00000
title: Mulliken charges with hydrogens summed into heavy atoms:
elementType: O C C C C C C C C C C C
charge: -0.207859 0.145143 0.081258 -0.080275 -0.087641 0.128729 -0.037142 -0.048446 -0.002253 -0.005107 0.173440 -0.059847
polarizability: 1.18785285e+02 4.82783802e+00 1.14875901e+02 -1.19831756e+00 -1.34485472e+00 9.85940637e+01
1716.lowfreq: -8.8306 -0.0007 -0.0003 0.0001 8.6379 23.0620 37.5697 83.6489 106.0607
frequency: 36.8148 83.6319 106.0453 140.0003 172.7418 223.6566 286.5308 298.1232 348.2590 388.0660 401.5724 454.2411 477.6770 565.4914 572.0613 599.9376 619.5857 717.7522 759.9862 799.0827 807.4896 856.5434 870.2401 888.8715 914.9290 938.4260 946.5933 964.3500 971.7831 986.6772 1013.7571 1019.9873 1061.1559 1072.1136 1081.9528 1116.0649 1134.8816 1144.9523 1166.9863 1187.6086 1203.5564 1234.1816 1252.0167 1271.2619 1305.2533 1310.0944 1312.4405 1328.6605 1337.1620 1342.7944 1350.9603 1354.8643 1364.8414 1383.9276 1441.6543 1450.3587 1453.0863 1458.5775 1460.9324 1475.3057 1627.1505 1665.7486 2947.5082 2963.3265 2975.4842 2977.0127 2982.6231 2986.1517 2990.9906 2992.6759 3002.5450 3027.1380 3041.7425 3049.5696 3060.9143 3087.2142 3118.3298 3119.9764
redmass: 4.5320 3.3852 1.0294 2.4839 3.3557 4.5793 2.3656 2.7847 2.5895 2.6686 2.0190 2.4174 2.6817 3.7122 2.5687 2.6937 4.3241 1.6910 3.2815 2.8853 2.7155 1.5087 3.3957 2.3005 1.7603 1.9971 2.0259 2.0513 1.2955 3.1720 2.0372 1.9996 1.5475 1.8991 1.8676 1.6695 1.0688 1.2287 1.7048 1.1042 1.2030 1.6666 1.4069 1.5878 1.6624 1.4977 1.3812 1.4102 1.6035 1.4163 1.5246 1.5088 1.2655 1.5932 1.0701 1.0869 1.0581 1.0856 1.0877 1.0895 7.7468 6.4943 1.0614 1.0621 1.0667 1.0383 1.0708 1.0860 1.0829 1.0830 1.0782 1.1019 1.1031 1.1019 1.0952 1.0840 1.1003 1.0997
irintensity: 4.7491 2.3508 0.3029 0.0932 2.2319 2.5415 1.0609 0.5888 0.6659 0.8999 0.5305 0.3911 3.8698 3.8862 0.1635 23.1560 0.2344 37.4346 5.2576 1.2525 2.6110 2.2288 1.5618 0.3815 5.7500 2.6061 13.3607 5.6097 0.7389 3.2443 8.8238 3.0026 0.1022 0.8665 1.4775 3.4980 0.7850 2.6927 29.2805 3.8312 3.5949 59.2298 6.2994 27.8144 5.0376 23.6762 3.6550 4.4047 1.2488 2.5401 11.8190 6.0756 62.8459 1.8787 19.6371 10.0603 12.0504 14.3142 18.5713 9.9798 111.3645 3.2551 33.2933 15.0080 18.8346 3.7274 29.6123 26.8881 3.7155 107.0148 66.1575 35.2200 34.5777 40.9184 13.4688 10.4163 19.7419 53.5799
temp: 298.150 k
press: 1.00000 atm
elementType: 8 6 6 6 6 6 6 6 6 6 6 6 1 1 1 1 1 1 1 1 1 1 1 1 1 1 1 1
symmnumber: 1
zpe: 639431.8 jmol-1
zpe.correction: 0.243547 hartree
zpe.thermalcorrener: 0.254787 hartree
zpe.thermalcorrenthalpy: 0.255731 hartree
zpe.thermalcorrgfe: 0.206277 hartree
zpe.sumelectzpe: -503.052284 hartree
zpe.sumelectthermal: -503.041044 hartree
zpe.sumelectthermalent: -503.040100 hartree
zpe.sumelectthermalfe: -503.089554 hartree
dipole: 1.9096 2.3301 -0.8608
dipole: 3.1332
quadrupole: -81.4782 -71.7014 -70.8523
quadrupole: -6.5418 4.1950 1.1201
quadrupole: -6.8009 2.9759 3.8250 -6.5418 4.1950 1.1201
hfenergy: -503.2958306 hartree
pointgroup: C01 [X(C11H16O1)]
dipole: -0.7848248 -0.8478218 -0.4298562 debye
polarizability: 119.0984975|4.6176161|114.0519203|1.2991758|3.1804393|99.1048319 unknown
InChI: InChI=1S/C11H16O/c1-8(12)11-6-9-3-2-4-10(5-9)7-11/h2-3,9-11H,4-7H2,1H3
charge 0 multiplicity 1
28 atoms
O  3.097342 0.818014 0.454541
C  -1.178934 -0.84966 1.12594
C  -1.222262 1.41809 0.034385
C  -1.617407 0.625659 1.306591
C  0.366152 -0.904054 0.969598
C  0.894259 -0.017756 -0.209053
C  0.330941 1.420632 -0.117124
C  -1.950659 -1.490022 -0.066156
C  -1.893295 0.78747 -1.179337
C  -2.217101 -0.53285 -1.217751
C  2.428177 -0.042602 -0.180247
C  3.109981 -1.174489 -0.942178
H  -1.429525 -1.421974 2.041974
H  -1.557335 2.469751 0.130143
H  -1.121328 1.061726 2.196067
H  -2.710858 0.686034 1.466256
H  0.557359 -0.484302 -1.155738
H  0.693242 -1.953817 0.829669
H  0.827306 -0.541878 1.911047
H  0.626375 1.991374 -1.01878
H  0.789566 1.933248 0.749817
H  -2.923313 -1.888183 0.293737
H  -1.393763 -2.375637 -0.43953
H  -2.097662 1.429492 -2.047381
H  -2.708232 -0.952659 -2.107568
H  2.608498 -2.142015 -0.754985
H  3.034435 -0.979457 -2.0302
H  4.174039 -1.241436 -0.66644
