program: Gaussian 09
title: 000296181
version: EM64L-G09RevD.01
frameworkgroup: C1[X(C18H22Cl3N3O3)]
method: RPBEPBE
basis: SDD
operation: Freq
keyword: #p
keyword: freq=noraman
keyword: PBEPBE/SDD
title: #p freq=noraman PBEPBE/SDD
converged: YES YES NO NO
title: Mulliken charges:
elementType: Cl Cl Cl O O O N N N C C C C C C C C C C C C C C C C C C H H H H H H H H H H H H H H H H H H H H H H
charge: -0.070734 -0.052492 -0.050592 -0.292267 -0.267350 -0.282681 -0.339640 -0.175663 -0.402919 -0.337178 0.661601 0.059709 0.480177 0.248198 -0.410773 -0.380789 -0.361384 -0.412923 -0.386637 -0.392883 0.123279 0.128234 -0.812026 -0.586539 -0.584762 -0.211979 -0.675403 0.310731 0.339707 0.247523 0.263310 0.237387 0.251416 0.251340 0.251411 0.251945 0.334933 0.247375 0.319417 0.228261 0.269601 0.293436 0.295591 0.269593 0.225900 0.227159 0.229677 0.230185 0.210520
chargesum: 0.00000
title: Mulliken charges with hydrogens summed into heavy atoms:
elementType: Cl Cl Cl O O O N N N C C C C C C C C C C C C C C C C C C
charge: -0.070734 -0.052492 -0.050592 -0.292267 -0.267350 -0.282681 0.000067 -0.175663 -0.067986 -0.026447 0.661601 0.059709 0.480177 0.248198 -0.410773 -0.133266 -0.098074 -0.175537 0.116119 0.110473 0.123279 0.128234 -0.016973 -0.023502 -0.019578 0.241079 -0.005022
polarizability: 3.05633239e+02 -1.35117260e+00 2.65310458e+02 2.21115469e+01 -9.47201018e+00 2.42504451e+02
1716.lowfreq: -7.4121 -3.7588 -3.4413 -0.0019 -0.0002 0.0005 11.6597 15.7371 26.2398
frequency: 10.7732 15.6719 26.2235 28.3961 33.4401 40.3977 44.3967 55.6038 64.9448 67.5082 73.6447 90.1116 103.3179 115.9138 126.1990 132.0423 152.3746 164.9587 179.0266 186.5316 207.3996 215.3633 233.8952 241.0930 253.2727 266.0908 280.7802 311.9722 335.6680 346.9547 364.2785 375.9876 396.5742 420.3346 427.8940 444.1820 455.4796 491.4961 535.7523 543.6207 562.1462 575.5211 592.2939 613.7179 642.3582 655.1489 663.0517 679.4826 692.0810 701.9838 722.5542 733.4922 759.4638 780.8180 784.0840 786.6155 791.5767 798.2126 819.8794 840.3002 844.0948 850.3574 916.6875 957.1742 960.7005 993.5425 1000.1981 1012.3001 1017.5695 1034.0615 1036.3161 1043.5843 1044.2375 1051.8031 1079.5283 1111.7682 1120.0202 1131.3836 1136.4715 1160.8637 1184.1814 1210.7833 1213.2903 1221.9020 1247.8539 1252.8393 1256.6650 1258.4017 1279.8493 1283.0358 1291.7520 1294.9839 1316.6820 1351.6541 1353.5105 1358.9565 1369.8727 1380.4014 1384.9292 1396.6279 1400.1478 1412.3226 1423.3314 1434.1332 1458.6616 1458.8447 1460.1565 1464.2021 1473.9782 1485.3404 1487.4616 1491.3902 1494.2323 1509.1136 1549.8820 1595.0774 1623.0915 1644.2483 1675.7170 2977.8889 2994.6245 3007.1515 3014.1485 3018.8395 3052.9209 3053.3182 3063.0385 3064.0509 3064.6673 3070.2687 3075.9103 3091.2496 3105.8242 3132.9227 3136.0634 3147.4341 3148.5780 3166.6496 3179.4847 3544.9762 3554.2425
redmass: 8.7365 5.0526 4.6488 12.6112 7.9085 7.4724 7.4813 1.6169 2.1291 3.3814 6.3182 3.1086 3.8777 2.7562 3.6189 2.9028 8.0839 4.2368 5.4746 7.1077 5.9448 5.1293 4.2655 4.0175 1.4532 4.3865 3.6125 4.3002 5.4521 5.5521 5.3497 6.9461 5.4475 4.8287 4.9256 3.8393 3.9025 4.4834 3.2270 4.5281 4.3882 3.7873 2.6864 2.0034 1.4627 3.5385 6.2371 6.2529 4.4618 5.0022 4.9432 6.0393 4.3636 2.6795 1.4405 2.4846 1.3654 1.1124 1.9749 1.5884 3.9729 3.9431 3.3964 1.4854 2.3829 2.4541 1.4368 2.5050 2.6463 3.9611 3.1109 3.4570 2.2363 1.5356 2.4727 2.2084 1.5074 2.7911 1.4773 1.7419 1.7647 1.9991 2.4478 2.0704 1.1337 1.4225 1.1732 1.2249 1.3184 2.9082 1.2078 2.1485 1.4811 1.2980 1.4115 1.4818 3.2344 2.0204 1.7931 1.2312 1.2748 2.0158 3.2626 1.7153 1.2346 1.1636 1.0940 1.0403 1.0575 1.0867 1.0709 1.0502 2.1596 1.3176 6.8180 9.1905 7.1352 6.4897 5.2909 1.0395 1.0358 1.0580 1.0602 1.0611 1.0942 1.0873 1.0570 1.0580 1.1065 1.1028 1.1036 1.0986 1.1024 1.0970 1.0880 1.1119 1.1116 1.0937 1.0910 1.0771 1.0779
irintensity: 0.0964 0.1442 0.1241 0.5765 0.3460 0.9103 1.2902 0.6248 0.0488 0.7254 2.6805 1.3972 0.1797 2.2478 2.7521 3.1063 0.7418 1.3291 1.0551 0.0847 4.7414 0.4099 0.6686 12.8793 3.1202 13.4035 0.4937 2.0195 13.0826 3.3368 9.3491 1.7553 6.8989 11.5978 5.4315 7.1576 1.2672 1.8412 4.5588 24.3240 5.1175 16.2260 3.1892 21.6860 123.4824 41.8718 24.9718 13.6288 51.8440 56.9495 96.5190 6.7808 8.6608 7.4200 4.5076 14.2744 11.8637 3.3144 24.4001 28.3150 17.0034 16.9309 8.3187 8.9017 40.9723 10.9372 3.2212 28.4448 35.2810 0.3085 0.3317 296.7059 142.0870 7.0076 33.1895 1.0590 45.7222 2.7361 5.8904 10.0465 88.9796 231.1894 57.3804 30.7179 0.1719 115.5890 16.7269 6.5056 13.2282 171.5512 18.9199 6.0212 10.4652 16.8305 45.4820 2.2089 3.8199 156.3576 30.1757 33.7658 27.4011 44.4422 0.8707 82.1386 17.7359 2.8271 7.6216 11.3610 8.0659 25.2360 11.4232 13.9271 152.2039 104.9076 59.1339 295.8506 361.8465 271.8723 560.8354 32.9509 19.7627 24.5848 23.2741 13.2232 12.6909 0.5635 11.8371 16.5009 9.4354 8.8538 10.4992 33.9086 42.8993 5.3823 3.8082 8.6621 15.0530 15.7910 7.0958 42.5158 68.5547
temp: 298.150 k
press: 1.00000 atm
elementType: 17 17 17 8 8 8 7 7 7 6 6 6 6 6 6 6 6 6 6 6 6 6 6 6 6 6 6 1 1 1 1 1 1 1 1 1 1 1 1 1 1 1 1 1 1 1 1 1 1
symmnumber: 1
zpe: 996912.6 jmol-1
zpe.correction: 0.379704 hartree
zpe.thermalcorrener: 0.408550 hartree
zpe.thermalcorrenthalpy: 0.409494 hartree
zpe.thermalcorrgfe: 0.314187 hartree
zpe.sumelectzpe: -2467.233926 hartree
zpe.sumelectthermal: -2467.205080 hartree
zpe.sumelectthermalent: -2467.204136 hartree
zpe.sumelectthermalfe: -2467.299443 hartree
dipole: 1.0603 2.8613 1.2915
dipole: 3.3134
quadrupole: -186.7066 -208.1013 -174.4048
quadrupole: -3.5425 -1.3639 -6.9837
quadrupole: 3.0310 -18.3637 15.3328 -3.5425 -1.3639 -6.9837
hfenergy: -2467.6136304 hartree
pointgroup: C01 [X(C18H22Cl3N3O3)]
dipole: 0.4216012 -0.3699215 1.1767725 debye
polarizability: 303.127932|-24.9768781|248.1177316|1.5498821|12.6306593|262.2024841 unknown
InChI: InChI=1S/C18H22Cl3N3O3/c1-3-27-17(25)15-11(2)22-18(26)23-16(15)13-5-4-12(10-14(13)21)24(8-6-19)9-7-20/h4-5,10,16,22-23H,3,6-9H2,1-2H3
charge 0 multiplicity 1
49 atoms
Cl -0.340004 -1.94974 -2.742931
Cl 4.874584 1.332667 3.819851
Cl 6.103876 -1.354516 -2.934726
O  -2.793334 -1.797703 1.082809
O  -2.752424 2.685686 -3.248941
O  -3.914038 -0.253914 2.41796
N  -2.444299 0.618606 -2.176876
N  3.610833 -0.056399 0.118636
N  -3.18634 2.47411 -0.960646
C  -2.151742 -0.139758 -0.929295
C  -0.641374 -0.124801 -0.620602
C  -3.010446 0.393498 0.217308
C  2.220695 -0.077891 -0.120673
C  -3.460579 1.704414 0.175005
C  0.27979 -0.887379 -1.369582
C  -0.069813 0.672804 0.400628
C  1.665614 -0.887406 -1.15888
C  1.31202 0.702231 0.658557
C  4.195137 0.822082 1.147385
C  4.538527 -0.900415 -0.654831
C  -2.763803 1.956491 -2.21581
C  -3.304628 -0.510433 1.340475
C  -4.260658 2.427266 1.23452
C  4.139059 0.15702 2.536202
C  4.92751 -0.223046 -1.983521
C  -3.019574 -2.81131 2.152671
C  -2.363721 -4.104379 1.678187
H  -2.434082 -1.187809 -1.121795
H  -2.147249 0.200699 -3.061416
H  -0.738795 1.276488 1.023766
H  2.29314 -1.506395 -1.803104
H  1.673277 1.334318 1.47404
H  5.248205 1.030962 0.889058
H  3.678737 1.797886 1.174268
H  4.099726 -1.894568 -0.851682
H  5.451704 -1.074045 -0.058832
H  -3.481516 3.451941 -0.990183
H  -5.27575 2.653927 0.856094
H  -4.35285 1.813625 2.139924
H  -3.776675 3.389868 1.489142
H  4.745361 -0.759699 2.583918
H  3.109815 -0.044794 2.865483
H  4.06435 -0.059177 -2.644155
H  5.474872 0.718191 -1.826232
H  -2.579005 -2.431733 3.092513
H  -4.10872 -2.919225 2.306935
H  -2.817077 -4.455397 0.735362
H  -1.282736 -3.959014 1.510811
H  -2.495903 -4.892435 2.442001
