program: Gaussian 09
title: 000296091
version: EM64L-G09RevD.01
frameworkgroup: C1[X(C12H15NO2)]
method: RPBEPBE
basis: SDD
operation: Freq
keyword: #p
keyword: freq=noraman
keyword: PBEPBE/SDD
title: #p freq=noraman PBEPBE/SDD
converged: YES YES NO NO
title: Mulliken charges:
elementType: O O N C C C C C C C C C C C C H H H H H H H H H H H H H H H
charge: -0.253074 -0.251514 -0.468544 0.088434 0.351042 0.376432 -0.380443 -0.457085 -0.865060 -0.226608 -0.844034 0.181908 -0.630847 0.281093 -0.769836 0.304880 0.386966 0.228380 0.247452 0.234886 0.257973 0.224251 0.230453 0.229802 0.231722 0.270104 0.263070 0.251118 0.261057 0.246019
chargesum: 0.00000
title: Mulliken charges with hydrogens summed into heavy atoms:
elementType: O O N C C C C C C C C C C C C
charge: -0.253074 -0.251514 -0.081577 0.088434 0.351042 0.376432 -0.075562 -0.228704 -0.124749 -0.002357 -0.152057 0.181908 -0.097672 0.281093 -0.011642
polarizability: 2.10162158e+02 4.83446481e+00 1.56211741e+02 4.06680272e+00 -3.10977359e+00 7.95570146e+01
1716.lowfreq: -0.0002 0.0003 0.0007 5.3693 6.1695 6.6185 29.2058 46.2414 68.5533
frequency: 29.1198 46.2213 68.5327 83.8134 103.3486 133.5923 151.3819 163.9263 189.1455 201.2882 238.3896 264.4807 294.3442 311.3694 338.8263 371.9231 445.4889 463.4933 492.9734 504.0769 525.9009 545.4788 566.6716 592.0483 638.6330 731.1970 762.4397 799.4461 803.4480 815.7695 845.8419 877.5852 906.5055 916.6802 935.4586 980.6819 990.6988 993.3104 1021.5440 1025.4925 1050.2881 1073.0034 1096.4647 1156.9625 1178.1800 1188.0020 1196.6271 1216.0379 1263.2250 1291.1514 1310.7231 1371.4246 1374.4904 1396.1270 1404.1588 1422.7092 1437.2582 1441.3669 1451.0075 1457.0992 1468.5283 1473.2104 1493.3074 1497.9406 1554.6657 1599.5253 1600.8152 1612.5292 1645.1802 2967.0238 2972.7033 2977.6689 2982.1107 3033.8291 3048.2546 3063.8061 3082.9167 3093.2413 3112.9376 3123.2760 3127.7989 3149.3082 3194.4099 3331.9541
redmass: 3.4456 4.5860 3.1955 4.8137 3.0855 1.2616 1.1884 2.2106 1.1515 4.9495 2.7360 4.9357 4.4390 3.4790 2.6259 3.7701 2.9297 3.1883 4.1283 3.1190 4.5390 3.6488 4.1656 3.9868 4.8414 2.3936 4.2588 1.4437 3.9606 2.2729 1.9094 1.6539 2.2643 1.3451 3.2410 1.8072 1.3235 1.4447 1.8031 1.4453 1.6249 2.1629 1.8996 1.3993 1.5260 1.9302 2.2575 3.1274 1.7456 2.8246 1.8758 5.4169 1.2748 1.2870 1.2076 1.1012 2.2254 1.0946 1.0539 1.9594 1.0480 1.3728 1.1748 1.0597 2.0702 6.5439 6.0218 6.9105 3.2276 1.0419 1.0378 1.0647 1.0405 1.0972 1.0976 1.0954 1.0978 1.0922 1.0928 1.0874 1.1002 1.0956 1.0949 1.0796
irintensity: 1.0366 1.2016 8.7486 5.1793 4.3821 0.3919 0.6986 1.4087 2.4196 10.1079 2.3533 2.4450 5.3889 4.8268 0.2000 1.8306 1.0485 1.3141 10.5718 0.0182 24.7084 1.5580 7.1807 3.3852 1.7413 16.7392 3.5826 43.8324 8.0790 7.7028 34.7264 32.9129 2.4031 5.3508 10.2143 21.4682 2.7021 10.6276 17.2759 11.4313 1.7222 8.3361 13.7771 33.0774 12.0921 3.8938 2.6196 137.4332 3.8832 72.9517 45.5620 46.6897 66.7477 2.7016 16.2874 56.9144 24.2182 12.7512 20.1372 23.2854 23.0516 84.6228 70.7698 15.2781 418.1030 99.7631 19.8671 94.1883 159.1271 21.1013 36.1527 0.9897 1.3529 16.3720 21.8603 7.4921 23.7086 7.8413 17.7637 11.6747 10.8975 31.1197 6.0384 202.8217
temp: 298.150 k
press: 1.00000 atm
elementType: 8 8 7 6 6 6 6 6 6 6 6 6 6 6 6 1 1 1 1 1 1 1 1 1 1 1 1 1 1 1
symmnumber: 1
zpe: 640922.1 jmol-1
zpe.correction: 0.244114 hartree
zpe.thermalcorrener: 0.259583 hartree
zpe.thermalcorrenthalpy: 0.260527 hartree
zpe.thermalcorrgfe: 0.200673 hartree
zpe.sumelectzpe: -670.390234 hartree
zpe.sumelectthermal: -670.374766 hartree
zpe.sumelectthermalent: -670.373822 hartree
zpe.sumelectthermalfe: -670.433676 hartree
dipole: 2.5172 -2.5507 0.3189
dipole: 3.5978
quadrupole: -64.4017 -97.9503 -90.0835
quadrupole: 0.2322 0.5275 -0.5237
quadrupole: 19.7435 -13.8051 -5.9383 0.2322 0.5275 -0.5237
hfenergy: -670.6343486 hartree
pointgroup: C01 [X(C12H15N1O2)]
dipole: 0.9141242 1.079897 -0.0419013 debye
polarizability: 208.9526723|0.42214|155.0924608|-14.9857912|8.0326375|81.8857805 unknown
InChI: InChI=1S/C12H15NO2/c1-8-5-4-6-11(10(8)3)13-12(15)7-9(2)14/h4-6,13H,7H2,1-3H3
charge 0 multiplicity 1
30 atoms
O  1.563447 -2.176962 -0.724852
O  2.426281 1.977885 -0.076267
N  0.575329 -0.042592 -0.480599
C  -1.684767 0.754807 -0.021099
C  -0.798058 -0.349606 -0.237377
C  -3.063288 0.491018 0.221549
C  -1.271607 -1.686976 -0.213326
C  -3.5253 -0.850256 0.244314
C  -1.142153 2.176628 -0.059499
C  -2.638277 -1.925074 0.028531
C  -4.05968 1.617382 0.457334
C  1.627567 -0.911363 -0.69599
C  2.991777 -0.221581 -0.978269
C  3.308031 1.082679 -0.246239
C  4.724893 1.262305 0.260583
H  -0.571249 -2.506825 -0.380134
H  0.855791 0.951197 -0.435273
H  -4.587381 -1.045959 0.432468
H  -0.351487 2.34193 0.698506
H  -0.699511 2.421646 -1.045503
H  -1.93233 2.917321 0.13122
H  -3.009542 -2.955701 0.048512
H  -3.797215 2.224303 1.344694
H  -4.115286 2.308466 -0.405159
H  -5.071562 1.209971 0.621752
H  3.016428 0.002335 -2.06639
H  3.771652 -0.977642 -0.795061
H  4.919967 0.539273 1.076631
H  4.873998 2.284773 0.639276
H  5.458536 1.043417 -0.537531
