program: Gaussian 09
title: 000296095
version: EM64L-G09RevD.01
frameworkgroup: C1[X(C20H16N2O2)]
method: RPBEPBE
basis: SDD
operation: Freq
keyword: #p
keyword: freq=noraman
keyword: PBEPBE/SDD
title: #p freq=noraman PBEPBE/SDD
converged: NO YES NO NO
title: Mulliken charges:
elementType: O O N N C C C C C C C C C C C C C C C C C C C C H H H H H H H H H H H H H H H H
charge: -0.262844 -0.262844 -0.413301 -0.413301 0.363118 0.363117 0.236725 0.236725 0.289778 0.289779 -0.575586 -0.575587 0.366034 0.366035 -0.397596 -0.397595 -0.418498 -0.418498 -0.455756 -0.455757 0.052493 0.052492 -0.817847 -0.817848 0.255051 0.255051 0.245110 0.245110 0.234256 0.234256 0.329448 0.329448 0.252313 0.252314 0.241405 0.235559 0.240139 0.241405 0.235559 0.240139
chargesum: 0.00000
title: Mulliken charges with hydrogens summed into heavy atoms:
elementType: O O N N C C C C C C C C C C C C C C C C C C C C
charge: -0.262844 -0.262844 -0.083854 -0.083853 0.363118 0.363117 0.236725 0.236725 0.289778 0.289779 -0.320535 -0.320536 0.366034 0.366035 -0.152486 -0.152486 -0.184243 -0.184242 -0.203443 -0.203443 0.052493 0.052492 -0.100744 -0.100745
polarizability: 4.91766667e+02 2.36106299e-05 2.36304387e+02 9.03144593e+00 -3.70370135e-05 1.13607161e+02
1716.lowfreq: -3.6689 -0.0007 -0.0006 0.0006 3.0435 5.6394 30.6639 30.9414 45.4027
frequency: 30.6625 30.9336 45.4027 80.7623 117.9427 150.9117 161.1063 172.8353 173.6940 188.6579 196.3556 203.0897 215.0976 216.4315 284.9652 299.3918 317.3614 336.6650 394.4487 404.6292 417.4188 422.3616 465.1270 488.5742 495.2879 498.5517 519.3405 524.5157 531.0962 541.6723 557.4605 576.9795 597.7254 619.3823 652.8256 664.6290 685.0429 695.1678 733.8419 734.0338 763.4497 763.8897 771.3841 822.1394 826.3758 835.3050 871.3233 874.0420 875.2547 901.9193 909.6835 917.2213 930.9471 931.3901 951.1900 956.4018 1004.2946 1005.4269 1046.8544 1047.0790 1056.3013 1067.4338 1069.4750 1159.3085 1164.9001 1204.5130 1212.8349 1249.0702 1251.4043 1272.8642 1274.4159 1279.6327 1287.1966 1306.1515 1326.1259 1352.7789 1390.6407 1397.2862 1400.0073 1404.8231 1407.5262 1413.9627 1434.5273 1448.9337 1468.0399 1468.4682 1471.1571 1471.1585 1491.5796 1507.1107 1559.7940 1564.9722 1587.7362 1592.1837 1620.8254 1626.6269 1653.8714 1655.2084 2978.1973 2978.2639 3053.9352 3053.9615 3100.3396 3100.4749 3125.5856 3127.2438 3144.5894 3148.7704 3150.4512 3154.0752 3170.9015 3170.9250 3511.1969 3511.2829
redmass: 3.9056 7.9779 6.5038 6.9362 5.4664 4.1562 4.0757 1.5666 1.4622 4.1893 6.7424 5.9713 1.7509 1.8493 3.4131 5.0532 4.5901 5.6118 6.3488 4.7436 3.3203 3.6387 6.3439 5.5728 6.0907 4.6898 5.5133 3.3780 2.8691 5.2913 4.3365 5.3593 2.9517 2.1653 6.8805 2.1497 3.1142 4.3610 1.8124 1.7989 3.5969 3.4690 5.0514 1.5119 4.1024 1.6635 5.4527 1.4495 1.4564 1.4645 4.4374 1.6579 3.4393 3.2307 1.3568 1.3895 1.9236 1.9608 1.5682 1.5679 3.1605 2.1221 2.2411 1.2992 1.4214 2.2690 2.3784 1.5800 1.6976 2.1945 1.7860 3.0930 2.0712 1.9548 2.5834 2.5469 2.1902 1.3374 1.3909 4.6299 2.2817 4.4438 6.4816 4.2773 1.0656 1.0580 1.0987 1.1045 3.2297 3.5996 6.3493 6.2331 4.8729 5.3117 6.3247 6.7620 6.0913 6.0059 1.0382 1.0382 1.0970 1.0970 1.0982 1.0982 1.0874 1.0879 1.0914 1.0906 1.0962 1.0954 1.0926 1.0926 1.0767 1.0767
irintensity: 0.0072 3.0984 1.7873 0.0091 8.0710 0.6300 0.2051 0.3016 0.0023 3.3261 0.0539 2.0471 0.9879 0.2279 0.0627 2.8331 0.6393 5.9715 16.4329 1.3164 7.3311 2.3262 7.6832 1.2123 13.0701 11.9444 1.2083 15.5568 1.5240 0.0627 2.8945 2.1058 1.7915 0.4074 2.1883 53.0447 2.1394 7.5034 5.8267 75.5781 0.4821 0.6886 3.8992 126.7284 1.0761 9.7890 10.6541 30.5961 3.0322 36.2531 1.6167 3.0593 38.4743 0.4577 4.4741 0.0693 0.5017 4.1565 11.0069 1.1562 0.0937 9.2210 0.4954 15.7464 9.0117 0.3616 16.9811 11.2323 20.5750 47.2938 1.9059 17.8320 49.2929 12.0043 58.6558 61.5463 55.1919 11.0295 5.9374 61.5963 29.5630 3.7972 17.8755 60.8191 19.7045 8.6802 19.3817 7.5915 58.4981 4.7114 44.0314 1.5018 27.1203 263.2001 0.0354 103.2065 1153.8404 1.5243 11.3293 16.7879 3.2816 26.2834 25.4734 20.5638 22.6834 3.6024 12.0900 14.3659 3.5221 10.2905 2.0123 4.3398 40.4372 41.0089
temp: 298.150 k
press: 1.00000 atm
elementType: 8 8 7 7 6 6 6 6 6 6 6 6 6 6 6 6 6 6 6 6 6 6 6 6 1 1 1 1 1 1 1 1 1 1 1 1 1 1 1 1
symmnumber: 1
zpe: 816445.3 jmol-1
zpe.correction: 0.310968 hartree
zpe.thermalcorrener: 0.330575 hartree
zpe.thermalcorrenthalpy: 0.331519 hartree
zpe.thermalcorrgfe: 0.262854 hartree
zpe.sumelectzpe: -1030.108526 hartree
zpe.sumelectthermal: -1030.088918 hartree
zpe.sumelectthermalent: -1030.087974 hartree
zpe.sumelectthermalfe: -1030.156639 hartree
dipole: 0.0000 -0.7594 0.0000
dipole: 0.7594
quadrupole: -229.1626 -111.9133 -141.5677
quadrupole: 0.0000 -1.8755 0.0000
quadrupole: -68.2814 48.9679 19.3135 0.0000 -1.8755 0.0000
hfenergy: -1030.4194934 hartree
pointgroup: C01 [X(C20H16N2O2)]
dipole: -0.0000012 -0.2987743 0.0000095 debye
polarizability: 490.9732875|0.001391|236.3043866|19.5182375|-0.0027046|114.4005409 unknown
InChI: InChI=1S/C20H16N2O2/c1-11-7-19(23)21-17-5-3-13(9-15(11)17)14-4-6-18-16(10-14)12(2)8-20(24)22-18/h3-10,21-22H,1-2H3
charge 0 multiplicity 1
40 atoms
O  -7.071702 0.140639 -0.416315
O  7.071708 0.140711 0.416329
N  -4.971296 -0.871386 -0.51243
N  4.971309 -0.871324 0.512494
C  -0.740994 -0.861699 -0.071471
C  0.741007 -0.86169 0.071533
C  -2.921362 0.316925 0.070107
C  2.921367 0.316944 -0.070099
C  -3.583838 -0.87801 -0.3695
C  3.583851 -0.877966 0.369563
C  -1.507839 0.291309 0.210483
C  1.507844 0.291311 -0.210473
C  -3.735614 1.499785 0.36434
C  3.73561 1.499796 -0.364387
C  -1.433104 -2.03385 -0.505081
C  1.433127 -2.033816 0.505196
C  -2.826492 -2.045815 -0.652254
C  2.826514 -2.045764 0.652369
C  -5.10657 1.43786 0.202183
C  5.106566 1.43789 -0.202226
C  -5.814566 0.237128 -0.251669
C  5.81457 0.237185 0.251687
C  -3.070953 2.774789 0.840919
C  3.07094 2.774772 -0.841027
H  -1.000175 1.188911 0.578657
H  1.000173 1.188892 -0.578687
H  -0.863318 -2.934141 -0.759811
H  0.863347 -2.9341 0.759967
H  -3.334993 -2.953567 -0.997689
H  3.335022 -2.953496 0.997846
H  -5.452604 -1.719892 -0.826987
H  5.452624 -1.719813 0.82709
H  -5.744395 2.301444 0.41081
H  5.744384 2.301467 -0.410896
H  -3.817029 3.565626 1.01972
H  -2.344913 3.152161 0.095927
H  -2.515441 2.609432 1.783413
H  3.81701 3.565604 -1.019873
H  2.344901 3.152179 -0.09605
H  2.515423 2.609364 -1.78351
