program: Gaussian 09
title: 000296085
version: EM64L-G09RevD.01
frameworkgroup: C1[X(C11H12ClNO2)]
method: RPBEPBE
basis: SDD
operation: Freq
keyword: #p
keyword: freq=noraman
keyword: PBEPBE/SDD
title: #p freq=noraman PBEPBE/SDD
converged: YES YES NO NO
title: Mulliken charges:
elementType: Cl O O N C C C C C C C C C C C H H H H H H H H H H H H
charge: -0.079204 -0.250860 -0.250428 -0.470567 0.348902 0.304608 -0.629734 -0.367878 0.185723 -0.253302 -0.808180 -0.218702 -0.260256 0.284079 -0.765989 0.390965 0.273493 0.267347 0.309662 0.247121 0.236920 0.255042 0.232892 0.256400 0.252420 0.263249 0.246280
chargesum: 0.00000
title: Mulliken charges with hydrogens summed into heavy atoms:
elementType: Cl O O N C C C C C C C C C C C
charge: -0.079204 -0.250860 -0.250428 -0.079602 0.348902 0.304608 -0.088894 -0.058216 0.185723 -0.253302 -0.069098 0.014190 -0.003857 0.284079 -0.004040
polarizability: 2.11923437e+02 5.96409261e+00 1.55492106e+02 3.11564927e+00 -3.18292206e+00 7.18051665e+01
1716.lowfreq: -7.6397 -4.6101 -0.0007 0.0001 0.0019 2.4650 27.9484 43.8016 65.4587
frequency: 27.8105 43.7893 65.4518 79.3222 93.6656 135.9279 147.8209 175.3697 195.3686 221.0933 239.6191 276.7831 302.0307 310.0393 360.1459 385.2775 444.6714 471.4785 503.4533 509.2422 547.7128 557.0759 585.6901 613.9201 718.4102 720.9674 792.0632 792.8637 814.9283 831.6993 879.5429 895.2616 913.6853 934.4780 980.4029 988.1938 1009.0210 1023.5374 1037.0530 1072.2785 1136.3950 1162.1911 1179.6731 1196.2899 1208.8197 1223.1415 1291.2111 1312.7972 1364.8468 1375.7961 1402.5984 1417.1121 1432.7046 1440.1950 1450.8641 1451.7222 1474.2218 1489.2146 1542.2304 1579.0694 1601.1974 1613.7478 1645.5439 2973.1545 2976.7191 2982.8872 3048.6235 3065.2868 3084.7246 3118.0428 3128.2411 3147.1737 3176.9033 3195.7660 3304.3701
redmass: 3.5152 5.7743 3.4298 6.1338 3.7372 2.3578 1.2709 1.2159 6.5707 4.1585 8.8823 4.4031 4.0411 3.6875 5.5645 5.3331 2.9913 3.3328 3.4232 4.9334 4.1195 4.4451 4.7101 5.1754 2.5448 5.3335 1.6780 3.6786 1.9328 3.5858 1.4598 2.0483 1.3592 4.2231 1.8201 1.3170 1.8483 1.8218 1.5009 2.0917 2.1661 1.4298 1.7352 1.6905 2.4705 2.1484 2.4805 1.8826 5.9451 1.2489 1.2782 1.0929 2.2235 1.0886 2.8569 1.0598 1.2291 1.0435 2.4503 4.4604 6.3707 7.2518 3.1401 1.0671 1.0407 1.0390 1.0976 1.0950 1.0912 1.0947 1.1004 1.0885 1.0955 1.0957 1.0802
irintensity: 0.7521 0.5145 6.1817 7.6813 4.7336 0.5215 1.5746 1.3727 13.2931 2.2976 1.3675 1.1574 4.1496 2.9809 9.9099 1.8689 2.8892 8.4849 0.0603 14.0841 0.7682 25.1508 5.5301 9.3310 18.5701 14.6611 51.6985 8.7706 8.6635 12.7773 58.9280 12.0029 4.1047 2.6487 17.9374 4.3570 70.5792 20.0506 4.3401 15.7873 14.9075 26.2038 7.0328 25.6039 35.2819 73.2872 70.5159 52.2356 23.3093 79.1079 21.1147 53.5446 47.7372 38.4519 24.2920 17.9207 123.0238 15.5844 280.1535 435.5898 5.9129 30.2846 153.8833 1.3442 15.8491 0.8701 14.4568 7.5609 6.5400 5.9973 9.3964 10.1444 4.5439 7.4245 262.1116
temp: 298.150 k
press: 1.00000 atm
elementType: 17 8 8 7 6 6 6 6 6 6 6 6 6 6 6 1 1 1 1 1 1 1 1 1 1 1 1
symmnumber: 1
zpe: 543646.6 jmol-1
zpe.correction: 0.207064 hartree
zpe.thermalcorrener: 0.222212 hartree
zpe.thermalcorrenthalpy: 0.223156 hartree
zpe.thermalcorrgfe: 0.163257 hartree
zpe.sumelectzpe: -1090.553503 hartree
zpe.sumelectthermal: -1090.538355 hartree
zpe.sumelectthermalent: -1090.537411 hartree
zpe.sumelectthermalfe: -1090.597310 hartree
dipole: 4.5781 -1.0751 0.3076
dipole: 4.7127
quadrupole: -75.7652 -103.2872 -95.5377
quadrupole: -10.3297 0.7868 -0.5617
quadrupole: 15.7649 -11.7572 -4.0077 -10.3297 0.7868 -0.5617
hfenergy: -1090.7605673 hartree
pointgroup: C01 [X(C11H12Cl1N1O2)]
dipole: 1.8074069 -0.3089653 0.2748514 debye
polarizability: 208.5941589|8.8294005|156.3577099|18.0399058|6.0920864|74.2688403 unknown
InChI: InChI=1S/C11H12ClNO2/c1-7(14)6-11(15)13-10-5-3-4-9(12)8(10)2/h3-5,13H,6H2,1-2H3
charge 0 multiplicity 1
27 atoms
Cl -4.107645 -1.990409 -0.458744
O  1.460013 2.350687 0.588741
O  2.532047 -1.788394 0.230905
N  0.600698 0.153782 0.444993
C  -0.781801 0.375922 0.184464
C  -1.601064 -0.792944 0.01846
C  2.999046 0.503547 0.951417
C  -1.332178 1.681167 0.09574
C  1.601768 1.092079 0.625338
C  -2.971757 -0.563889 -0.233104
C  -0.9958 -2.180511 0.11765
C  -2.709227 1.839742 -0.158191
C  -3.548057 0.718187 -0.326137
C  3.384584 -0.862328 0.380528
C  4.84085 -1.064028 0.01424
H  0.937917 -0.824936 0.449658
H  3.057011 0.415951 2.058174
H  3.739808 1.269154 0.66806
H  -0.676983 2.543978 0.223409
H  -0.198037 -2.334926 -0.633651
H  -0.548266 -2.35792 1.114707
H  -1.759076 -2.955181 -0.044769
H  -3.134221 2.846461 -0.227234
H  -4.617202 0.830428 -0.523771
H  5.079667 -0.468046 -0.888516
H  5.043489 -2.125553 -0.193464
H  5.505618 -0.700119 0.819199
