program: Gaussian 09
title: 000296086
version: EM64L-G09RevD.01
frameworkgroup: C1[X(C12H15NO3)]
method: RPBEPBE
basis: SDD
operation: Freq
keyword: #p
keyword: freq=noraman
keyword: PBEPBE/SDD
title: #p freq=noraman PBEPBE/SDD
converged: YES YES NO NO
title: Mulliken charges:
elementType: O O O N C C C C C C C C C C C C H H H H H H H H H H H H H H H
charge: -0.314505 -0.261570 -0.239432 -0.445783 0.292334 0.213228 -0.330422 -0.619643 0.178398 -0.328190 -0.242401 -0.255325 -0.273599 0.269573 -0.673726 -0.771740 0.403851 0.307778 0.267578 0.257925 0.232043 0.225909 0.234062 0.199816 0.223566 0.215858 0.241048 0.241238 0.249041 0.258907 0.244187
chargesum: 0.00000
title: Mulliken charges with hydrogens summed into heavy atoms:
elementType: O O O N C C C C C C C C C C C C
charge: -0.314505 -0.261570 -0.239432 -0.041933 0.292334 0.213228 -0.022644 -0.094140 0.178398 -0.096147 -0.016492 -0.031759 0.160279 0.269573 0.024418 -0.019606
polarizability: 2.03616236e+02 2.32333210e+00 1.71040496e+02 -2.42463933e+00 -7.83683236e+00 8.39816972e+01
1716.lowfreq: -9.2199 -1.8539 -0.0008 -0.0007 -0.0007 6.9953 19.8618 38.0987 52.1552
frequency: 19.7446 38.0655 52.1251 60.3339 85.5718 98.2813 111.0504 151.7920 169.5116 191.4778 210.5404 238.1016 283.2609 296.6455 317.2221 363.8626 393.3047 452.8172 464.1851 487.3717 507.4177 541.1292 563.1813 574.4000 601.1548 685.6014 736.5153 749.4705 753.1865 807.9483 814.9183 829.3853 855.0712 884.8583 897.8143 903.4340 932.5107 937.9626 980.6919 982.3554 1021.2155 1024.8035 1044.3995 1088.4081 1108.2492 1149.2445 1153.1172 1172.8021 1185.2401 1196.5718 1208.4196 1258.2757 1273.7373 1296.1571 1309.9453 1357.5248 1371.9710 1391.3782 1392.6591 1425.9550 1441.4510 1442.5353 1451.5111 1463.4368 1477.7753 1479.1807 1491.7176 1531.7944 1598.0715 1605.1675 1611.6456 1630.5884 2979.7780 2982.4255 2989.2508 2993.0200 3062.3929 3077.9176 3088.2361 3097.4831 3107.9131 3126.0508 3133.2537 3151.7431 3167.2960 3193.1747 3325.2608
redmass: 3.4543 3.9451 5.1317 4.0173 3.7073 3.3574 3.9606 1.1564 3.5910 1.9806 2.3391 3.2865 4.5708 2.8513 3.9205 3.5425 3.5795 3.1788 3.1524 5.1252 3.6895 3.7354 3.8817 4.6913 4.5505 4.7649 4.5041 3.5330 1.3209 1.1667 2.2691 4.3180 1.3812 2.4843 1.5950 1.7507 4.2441 1.3500 1.9020 1.3003 1.8638 3.5185 2.1109 2.0740 2.1301 1.4222 1.6261 1.0701 2.1364 2.4116 2.8370 1.8584 1.1407 1.8558 1.7196 1.2842 1.2517 1.8113 2.4146 1.0995 2.1204 1.1506 1.0529 1.0459 2.0278 1.1859 1.0942 2.2359 5.4474 6.8938 7.7449 4.9041 1.0445 1.0597 1.0540 1.0482 1.0958 1.0990 1.0971 1.0931 1.1020 1.1002 1.0856 1.0913 1.0974 1.0953 1.0792
irintensity: 1.6564 2.2148 1.7332 3.7907 10.0196 1.9299 2.9868 1.0365 3.4044 1.6238 3.0210 3.6701 4.0289 2.6049 0.5403 0.7247 3.9983 7.3005 1.3549 5.9206 38.8847 0.9996 2.0857 3.0082 4.9694 5.8088 0.2494 6.8361 94.3194 2.4927 6.7102 4.7348 1.8860 16.5481 54.3932 19.4692 14.9568 9.5298 18.9369 4.4105 14.9356 60.5652 31.2121 14.8493 75.7323 32.8084 2.7655 4.6633 20.2387 84.8466 110.9253 103.1154 16.1198 86.3482 29.9832 11.2776 78.1732 32.1826 12.1699 59.6741 48.0994 48.6539 18.9810 15.0490 75.4675 12.2690 26.3413 556.8376 26.4006 129.9109 13.3291 192.9004 0.4617 2.3999 41.8535 31.5959 8.1222 2.6177 41.6073 8.4270 35.0215 12.1229 1.4544 26.7877 21.0685 5.6318 175.7026
temp: 298.150 k
press: 1.00000 atm
elementType: 8 8 8 7 6 6 6 6 6 6 6 6 6 6 6 6 1 1 1 1 1 1 1 1 1 1 1 1 1 1 1
symmnumber: 1
zpe: 652888.4 jmol-1
zpe.correction: 0.248672 hartree
zpe.thermalcorrener: 0.265029 hartree
zpe.thermalcorrenthalpy: 0.265973 hartree
zpe.thermalcorrgfe: 0.202852 hartree
zpe.sumelectzpe: -745.515057 hartree
zpe.sumelectthermal: -745.498700 hartree
zpe.sumelectthermalent: -745.497756 hartree
zpe.sumelectthermalfe: -745.560877 hartree
dipole: 0.6912 3.4689 -0.2324
dipole: 3.5448
quadrupole: -68.5766 -99.0308 -95.5297
quadrupole: -1.4269 -0.2113 -0.2945
quadrupole: 19.1358 -11.3184 -7.8173 -1.4269 -0.2113 -0.2945
hfenergy: -745.7637292 hartree
pointgroup: C01 [X(C12H15N1O3)]
dipole: 0.3161834 -1.3579865 0.0290577 debye
polarizability: 197.5706758|-1.6060657|171.6084292|26.6540985|0.2206395|89.4593247 unknown
InChI: InChI=1S/C12H15NO3/c1-3-16-11-7-5-4-6-10(11)13-12(15)8-9(2)14/h4-7,13H,3,8H2,1-2H3
charge 0 multiplicity 1
31 atoms
O  -1.012698 -1.678677 0.310878
O  1.646969 2.46998 0.626547
O  2.520569 -1.732629 0.589854
N  0.634224 0.343581 0.563515
C  -0.680265 0.668368 0.135024
C  -1.579774 -0.43476 -0.019071
C  -1.140502 1.97943 -0.134274
C  2.982546 0.550834 1.317247
C  1.684263 1.211029 0.782882
C  -2.907938 -0.222884 -0.44082
C  -2.475948 2.185736 -0.551541
C  -3.355702 1.093899 -0.705564
C  -1.783111 -2.916568 0.083216
C  3.373585 -0.80919 0.734616
C  -1.79201 -3.330244 -1.394645
C  4.828649 -0.998587 0.349274
H  0.832858 -0.6668 0.67596
H  -0.446633 2.813306 -0.01439
H  2.846127 0.409977 2.410451
H  3.788359 1.289557 1.185148
H  -3.596935 -1.063901 -0.564035
H  -2.821415 3.204131 -0.757821
H  -1.252957 -3.663824 0.696018
H  -2.807946 -2.798311 0.487677
H  -4.388615 1.255572 -1.032215
H  -2.319985 -4.295173 -1.510859
H  -2.297297 -2.581663 -2.028298
H  -0.758924 -3.454482 -1.761572
H  5.08554 -0.316265 -0.484177
H  5.014648 -2.038501 0.040519
H  5.493214 -0.731938 1.192655
