program: Gaussian 09
title: 000296102
version: EM64L-G09RevD.01
frameworkgroup: C1[X(C14H13N3O3)]
method: RPBEPBE
basis: SDD
operation: Freq
keyword: #p
keyword: freq=noraman
keyword: PBEPBE/SDD
title: #p freq=noraman PBEPBE/SDD
converged: YES YES NO NO
title: Mulliken charges:
elementType: O O O N N N C C C C C C C C C C C C C C H H H H H H H H H H H H H
charge: -0.331338 -0.254724 -0.246660 -0.299911 -0.428384 0.012837 -0.308432 0.255929 0.438744 0.355627 -0.459759 -0.322542 -0.398990 0.274934 -0.239102 -0.257868 -0.144614 0.229790 -0.781277 -0.484202 0.306422 0.318744 0.282073 0.241725 0.309910 0.231012 0.231805 0.261163 0.264214 0.215064 0.232326 0.249560 0.245924
chargesum: 0.00000
title: Mulliken charges with hydrogens summed into heavy atoms:
elementType: O O O N N N C C C C C C C C C C C C C C
charge: -0.331338 -0.254724 -0.246660 -0.299911 -0.118474 0.012837 -0.002010 0.255929 0.438744 0.355627 -0.141015 -0.040469 -0.157266 0.274934 -0.008090 -0.026063 -0.144614 0.229790 -0.040835 0.243609
polarizability: 2.45313991e+02 2.66530243e+01 2.18554441e+02 9.35696020e-01 -4.57226180e+00 1.13278467e+02
1716.lowfreq: -7.6428 -6.2128 -3.9314 -0.0008 -0.0007 0.0005 24.6243 43.5447 52.6272
frequency: 24.5873 43.5346 52.6248 54.5068 64.8446 71.3433 86.2249 98.1360 105.4175 139.7115 155.1584 174.7629 207.4416 252.4322 274.0441 291.5946 307.7196 336.6716 356.7515 388.7607 399.6070 465.6741 475.0290 482.9197 500.2704 555.2783 572.5925 590.1537 595.9037 612.4910 623.9673 687.8234 694.3201 722.6502 740.7375 761.6139 775.7335 827.0826 866.3963 900.8930 903.1683 926.5729 929.2522 951.8834 957.4830 985.7641 1000.2969 1014.5075 1039.2106 1043.4803 1107.3891 1114.9106 1119.8249 1146.1595 1171.4074 1178.5151 1210.3791 1228.4653 1239.6396 1280.9838 1286.5917 1295.5589 1337.9865 1374.4559 1389.6933 1391.7559 1428.8161 1446.7260 1447.8324 1450.4544 1467.9160 1469.8952 1487.5750 1492.7706 1580.7364 1608.2802 1624.4541 1650.3002 1668.0519 2183.3049 2996.4425 3009.1690 3023.3952 3098.3799 3098.7153 3114.5782 3132.2068 3144.8504 3149.9787 3165.7632 3184.1844 3201.8717 3531.9820
redmass: 6.0369 1.6464 2.9153 3.4207 2.2309 2.2705 2.5593 5.2653 4.6814 3.9760 4.4225 4.6023 4.9308 7.3877 4.8359 6.1308 4.6306 4.9880 5.9200 5.5225 8.6310 3.5561 5.3596 5.2700 5.3370 3.8656 5.3407 2.2469 1.5354 6.1693 5.4171 8.0599 7.5721 5.8846 4.2602 1.2810 5.2509 6.1380 1.4087 4.5041 5.0463 2.8421 1.9388 1.5721 2.9030 1.3337 1.8771 7.9403 1.6277 2.3175 3.1762 2.3962 1.2787 1.4808 1.7970 1.0926 2.4639 2.6123 1.5596 2.1909 2.2187 1.9478 2.0794 1.7724 6.5311 1.2171 1.1901 2.5603 1.0451 1.0499 1.0542 1.0947 2.7194 2.0491 6.6567 6.5019 5.4753 10.5251 6.1825 12.5689 1.0363 1.0293 1.0821 1.1004 1.0981 1.1052 1.0867 1.0912 1.1052 1.0986 1.0931 1.0945 1.0769
irintensity: 0.4817 0.2545 1.8579 8.5203 2.5428 5.4526 1.8483 2.7394 1.0838 4.3494 3.7541 0.5690 2.2307 2.9097 6.7005 0.1857 15.7378 0.3658 4.6785 0.7155 2.9450 10.6812 2.0296 12.9919 8.8296 0.6177 3.2545 30.6102 35.6646 2.2304 1.4657 14.2772 5.3536 4.8461 1.3076 79.8748 9.8223 10.2723 1.3404 3.1833 1.4936 15.5165 36.2282 5.5251 22.5360 0.4673 26.2660 135.6054 14.6089 6.2233 54.1176 16.3169 1.5636 99.1933 5.5355 0.2985 16.7892 272.9241 133.7441 292.4908 44.8368 4.6719 83.0131 48.1607 7.9864 67.3462 64.3910 21.9493 14.1293 15.2290 11.1396 28.7816 55.7605 528.8995 1.9718 10.8089 121.0595 269.2565 27.1631 0.0298 12.1997 43.0136 11.6951 17.1282 6.0172 21.1156 2.0623 12.1876 13.0216 29.2562 2.8486 2.4031 18.4407
temp: 298.150 k
press: 1.00000 atm
elementType: 8 8 8 7 7 7 6 6 6 6 6 6 6 6 6 6 6 6 6 6 1 1 1 1 1 1 1 1 1 1 1 1 1
symmnumber: 1
zpe: 650896.3 jmol-1
zpe.correction: 0.247913 hartree
zpe.thermalcorrener: 0.266998 hartree
zpe.thermalcorrenthalpy: 0.267942 hartree
zpe.thermalcorrgfe: 0.198460 hartree
zpe.sumelectzpe: -929.784105 hartree
zpe.sumelectthermal: -929.765020 hartree
zpe.sumelectthermalent: -929.764076 hartree
zpe.sumelectthermalfe: -929.833558 hartree
dipole: -1.2968 -3.9878 -1.9655
dipole: 4.6312
quadrupole: -109.3525 -95.6203 -133.4201
quadrupole: 12.0749 1.5510 7.1597
quadrupole: 3.4451 17.1773 -20.6224 12.0749 1.5510 7.1597
hfenergy: -930.0320186 hartree
pointgroup: C01 [X(C14H13N3O3)]
dipole: 0.3280176 -1.5391401 0.9183032 debye
polarizability: 239.780783|-28.1780362|223.5147324|9.1789956|-5.8749457|113.8513825 unknown
InChI: InChI=1S/C14H13N3O3/c1-9(18)16-11-7-10-5-3-4-6-12(10)17(13(11)8-15)14(19)20-2/h3-7,13,16H,1-2H3
charge 0 multiplicity 1
33 atoms
O  -1.6221 -2.667427 0.560134
O  -3.243294 -1.017068 0.911379
O  4.012679 0.953607 0.918314
N  -1.085445 -0.471883 0.094074
N  2.604317 -0.826625 0.344996
N  0.398132 -1.464125 -2.944662
C  0.232852 -1.028398 -0.29531
C  -1.294424 0.94986 -0.057758
C  1.384034 -0.131293 0.168333
C  -0.140402 1.787965 0.054158
C  1.178123 1.213011 0.309461
C  -2.569785 1.512381 -0.288345
C  -0.306435 3.193184 -0.061475
C  -2.087024 -1.336731 0.550952
C  -2.704233 2.913493 -0.406373
C  -1.575553 3.758067 -0.291655
C  0.315655 -1.266409 -1.771249
C  3.848958 -0.279382 0.692137
C  4.990623 -1.286755 0.777455
C  -2.612469 -3.657353 1.041631
H  0.305811 -2.019785 0.187683
H  2.007786 1.861487 0.597937
H  -3.448984 0.870137 -0.350828
H  0.577597 3.834532 0.029868
H  2.585479 -1.835227 0.178613
H  -3.696005 3.340836 -0.588253
H  -1.686706 4.843596 -0.380932
H  5.429523 -1.24838 1.789266
H  5.782555 -0.991122 0.067874
H  4.690789 -2.326424 0.558763
H  -2.09549 -4.624395 0.967748
H  -3.51024 -3.637048 0.40247
H  -2.899824 -3.436223 2.082792
