program: Gaussian 09
title: 000296070
version: EM64L-G09RevD.01
frameworkgroup: C1[X(C17H21NO)]
method: RPBEPBE
basis: SDD
operation: Freq
keyword: #p
keyword: freq=noraman
keyword: PBEPBE/SDD
title: #p freq=noraman PBEPBE/SDD
converged: YES YES NO NO
title: Mulliken charges:
elementType: O N C C C C C C C C C C C C C C C C C H H H H H H H H H H H H H H H H H H H H H
charge: -0.268089 -0.348045 -0.212155 -0.638284 0.500635 0.511982 -0.326811 -0.423754 -0.396819 -0.401067 -0.420684 -0.355766 -0.361889 -0.695872 0.312986 -0.229721 -0.231236 -0.244358 -0.538012 0.217028 0.191921 0.242213 0.242390 0.183678 0.231150 0.239822 0.268283 0.242728 0.228215 0.247277 0.235774 0.229104 0.199879 0.214005 0.224484 0.221771 0.225984 0.219341 0.218769 0.243146
chargesum: 0.00000
title: Mulliken charges with hydrogens summed into heavy atoms:
elementType: O N C C C C C C C C C C C C C C C C C
charge: -0.268089 -0.105655 0.004872 -0.204151 0.500635 0.511982 0.088017 -0.183932 -0.128536 -0.158339 -0.192469 -0.108489 -0.126115 -0.052884 0.312986 -0.005237 -0.009465 -0.018374 0.143243
polarizability: 2.15378336e+02 -1.19089726e+01 2.14377483e+02 -2.86212450e+01 -8.19999459e+00 1.39961230e+02
1716.lowfreq: -7.5785 -5.6543 -0.0008 -0.0005 -0.0001 3.9348 22.2156 26.7954 41.9116
frequency: 21.9116 26.6076 41.8509 47.9099 62.1268 67.7204 99.1185 117.1045 138.9920 171.4229 180.5081 237.5653 247.1505 255.7314 274.2460 305.1179 336.1734 349.9222 399.7823 404.4744 418.1050 445.2598 501.8354 514.1124 543.2707 563.6622 592.7101 618.1141 628.9346 658.7890 703.2093 720.9344 737.0620 762.6928 794.1462 806.0164 820.0860 823.5787 836.3356 852.2038 904.6148 914.9782 943.3435 956.4405 973.9296 974.5066 989.8698 990.4463 992.9644 1001.9375 1014.3316 1027.6280 1042.0027 1081.8520 1099.4524 1111.6152 1115.2242 1128.3135 1146.5225 1157.0025 1169.4181 1172.3986 1172.7928 1187.8308 1206.1698 1220.4191 1225.0278 1252.8125 1272.4076 1291.4323 1307.9352 1327.1441 1334.0276 1355.5168 1382.8379 1387.5793 1392.5682 1415.2293 1435.9274 1439.5037 1454.1617 1466.1658 1466.9497 1472.9206 1474.5289 1480.5690 1484.6741 1498.0498 1501.2089 1587.0429 1592.9753 1614.6845 1621.3418 2846.7193 2861.8330 2955.8904 2967.0364 2976.0263 3020.4224 3041.8532 3049.4864 3069.1911 3089.8717 3109.8311 3121.1972 3121.5939 3125.1332 3130.5632 3132.4423 3143.5887 3155.9569 3161.3197 3164.3611 3425.5292
redmass: 4.2781 3.8374 3.4398 3.3609 3.8881 2.2838 2.6121 3.4131 4.2591 3.3768 3.1738 1.5189 1.3176 2.5450 2.7454 3.2254 3.4142 2.6557 3.8229 2.8716 2.9929 3.7276 3.7231 3.0921 3.2965 2.8648 2.7998 6.2648 6.8107 2.0535 1.8756 2.3403 3.2957 2.2390 4.3130 1.3971 2.0707 1.3007 1.6191 1.2511 1.9416 1.4455 1.7366 1.4464 1.3490 1.3870 7.6663 5.6663 1.3689 2.8849 2.7666 2.2218 2.9737 1.6485 1.7899 1.2610 1.6619 1.6225 1.7837 1.3478 1.4073 1.1334 1.3245 1.1216 1.8625 2.3987 4.0591 1.1698 1.2656 1.3849 1.3223 1.3075 1.6627 1.3674 7.8692 1.4781 2.4948 2.9603 1.1815 2.1270 1.2327 1.0507 1.1144 1.0818 1.0763 1.0509 2.3194 1.0857 2.3816 7.0292 6.0502 6.1786 6.4241 1.0814 1.0723 1.0331 1.0641 1.0373 1.0864 1.1037 1.0973 1.0976 1.1001 1.0871 1.0860 1.0988 1.0892 1.0880 1.0915 1.0960 1.0945 1.1015 1.0952 1.0741
irintensity: 0.0324 0.2425 0.0717 0.6903 0.3383 3.4438 0.8807 2.4963 0.5643 6.2277 2.9792 0.2905 0.9094 0.2368 0.0427 2.6862 1.4933 0.5614 1.4647 0.2489 0.2574 2.0959 5.9414 10.7880 20.6834 31.0125 48.3103 0.2356 1.3144 23.2621 57.3663 3.9553 9.2331 37.9187 4.4993 4.6507 4.1098 7.7135 73.9830 0.3761 0.8884 4.5593 5.5576 1.1199 1.5540 0.0255 40.3614 1.3574 0.5565 7.8809 1.8118 5.7150 9.6313 9.4479 13.7833 0.1792 0.1645 2.9420 52.7319 0.9553 24.3701 29.2281 29.3483 0.7809 12.9555 7.7246 181.2079 23.2981 1.4860 11.9027 5.1597 2.1709 25.0938 0.6312 0.5832 31.1430 2.6822 2.7539 9.5963 7.4683 18.9186 12.2419 6.6966 75.8838 10.2963 5.9374 15.5807 2.7455 92.1056 8.2340 1.2137 7.2451 51.5829 50.9556 116.3812 72.2598 50.5367 41.8084 13.7014 50.7636 19.3354 53.6319 37.3034 9.8233 2.4112 29.5189 12.7170 2.1469 16.1675 46.0601 16.8072 22.0910 6.1807 4.9388
temp: 298.150 k
press: 1.00000 atm
elementType: 8 7 6 6 6 6 6 6 6 6 6 6 6 6 6 6 6 6 6 1 1 1 1 1 1 1 1 1 1 1 1 1 1 1 1 1 1 1 1 1
symmnumber: 1
zpe: 885401.5 jmol-1
zpe.correction: 0.337232 hartree
zpe.thermalcorrener: 0.355927 hartree
zpe.thermalcorrenthalpy: 0.356871 hartree
zpe.thermalcorrgfe: 0.287975 hartree
zpe.sumelectzpe: -788.957594 hartree
zpe.sumelectthermal: -788.938898 hartree
zpe.sumelectthermalent: -788.937954 hartree
zpe.sumelectthermalfe: -789.006850 hartree
dipole: 0.5825 0.9866 -0.6276
dipole: 1.3063
quadrupole: -102.1119 -106.0742 -114.0084
quadrupole: -5.0780 -10.5748 3.7307
quadrupole: 5.2863 1.3239 -6.6102 -5.0780 -10.5748 3.7307
hfenergy: -789.2948252 hartree
pointgroup: C01 [X(C17H21N1O1)]
dipole: 0.2629834 -0.3466102 0.2735759 debye
polarizability: 207.0244427|12.3939215|217.6759658|34.4638807|-4.2806767|145.0166405 unknown
InChI: InChI=1S/C17H21NO/c1-3-18-17(13-14-7-5-4-6-8-14)15-9-11-16(19-2)12-10-15/h4-12,17-18H,3,13H2,1-2H3
charge 0 multiplicity 1
40 atoms
O  3.214011 3.006018 -0.273789
N  0.494424 -2.841709 0.441054
C  -0.221325 -1.636286 -0.043212
C  -1.429169 -1.373492 0.920779
C  0.722603 -0.432064 -0.103158
C  -2.399646 -0.325655 0.401564
C  1.512688 -3.392599 -0.481171
C  0.630683 0.521321 -1.148519
C  1.682806 -0.222087 0.913665
C  -2.288638 1.034914 0.785989
C  -3.427642 -0.688279 -0.507857
C  1.467714 1.652984 -1.178126
C  2.534362 0.905133 0.901745
C  2.166334 -4.650892 0.115238
C  2.423156 1.848907 -0.150655
C  -3.178583 2.007306 0.275871
C  -4.319732 0.279548 -1.021576
C  -4.197788 1.63351 -0.630311
C  4.221039 3.245459 0.760487
H  -0.644638 -1.789509 -1.068976
H  -1.965774 -2.336061 1.054323
H  -1.019315 -1.086088 1.906007
H  -0.166468 -3.571328 0.743943
H  1.084693 -3.632517 -1.487304
H  2.280953 -2.614225 -0.645482
H  -0.108303 0.379772 -1.946461
H  1.769894 -0.973689 1.706935
H  -1.494731 1.332419 1.481185
H  -3.533516 -1.738889 -0.808454
H  1.401486 2.39278 -1.981776
H  3.270948 1.032783 1.701404
H  2.634422 -4.416943 1.087712
H  1.420424 -5.453187 0.278635
H  2.942533 -5.048313 -0.563235
H  -3.07605 3.054092 0.583999
H  -5.110236 -0.020277 -1.719339
H  -4.889916 2.386402 -1.024309
H  4.967024 2.427217 0.795953
H  3.755938 3.363487 1.759068
H  4.715235 4.184236 0.469452
