program: Gaussian 09
title: 000296050
version: EM64L-G09RevD.01
frameworkgroup: C1[X(C14H23NOS)]
method: RPBEPBE
basis: SDD
operation: Freq
keyword: #p
keyword: freq=noraman
keyword: PBEPBE/SDD
title: #p freq=noraman PBEPBE/SDD
converged: YES YES NO NO
title: Mulliken charges:
elementType: S O N C C C C C C C C C C C C C C H H H H H H H H H H H H H H H H H H H H H H H
charge: 0.163026 -0.425271 -0.105769 -0.294580 -0.690564 -0.589215 -0.329425 -0.326480 0.521024 -0.350310 -0.669112 -0.669841 -0.371836 -0.366388 -0.233115 -0.241304 -0.239225 0.217603 0.204331 0.255494 0.256510 0.253473 0.191445 0.207871 0.206371 0.194127 0.229710 0.216748 0.210144 0.229044 0.199917 0.208253 0.226765 0.208015 0.233204 0.258330 0.223949 0.225034 0.227704 0.334346
chargesum: 0.00000
title: Mulliken charges with hydrogens summed into heavy atoms:
elementType: S O N C C C C C C C C C C C C C C
charge: 0.163026 -0.090925 -0.105769 0.127354 -0.178561 -0.335743 0.069890 0.074018 0.521024 0.096148 -0.030007 -0.026808 -0.138632 -0.108058 -0.009166 -0.016270 -0.011521
polarizability: 2.54195671e+02 -2.62515934e+00 1.60063441e+02 -1.68234849e+00 -1.08031179e+01 1.41204946e+02
1716.lowfreq: -10.3706 -0.0025 -0.0020 -0.0008 3.1058 7.8442 12.1806 17.9686 23.3327
frequency: 11.5539 17.3475 23.2754 36.0668 61.0086 64.1896 81.8288 88.5108 117.4704 147.9907 156.7954 195.2754 212.4366 216.3731 224.4249 241.5280 269.0391 288.6133 292.0723 334.4389 344.4367 387.6738 399.3604 442.4092 457.5721 476.3959 477.7539 577.9469 616.1711 676.9758 687.6727 698.7951 741.4359 750.8984 768.1076 786.0007 793.5577 796.6093 845.3480 910.3444 918.4096 936.1072 971.5133 979.0376 982.0600 991.3396 993.5296 1003.2606 1027.5265 1042.2322 1047.9282 1072.9859 1074.8347 1083.9322 1088.1869 1098.6501 1135.0091 1148.8176 1171.9158 1179.1853 1194.4658 1202.8541 1206.9222 1219.5153 1246.8461 1280.5822 1289.1544 1294.5415 1298.7749 1316.0483 1340.1283 1356.2162 1362.7078 1369.0793 1371.7909 1385.4163 1385.8567 1388.5606 1436.3906 1438.9691 1459.8360 1462.2336 1470.3305 1473.9185 1477.5956 1479.6498 1485.8398 1485.9013 1489.7391 1592.9198 1612.3785 2857.2820 2865.9872 2900.8162 2980.7439 2983.7121 2985.0405 2992.4114 3020.5957 3023.0390 3034.4785 3042.8814 3072.3923 3076.1488 3088.4093 3091.3214 3091.9904 3094.5623 3116.7621 3127.3090 3141.0927 3157.5686 3172.1653 3562.3988
redmass: 3.8658 4.3355 4.0844 4.2177 3.1206 2.4825 2.4083 3.3349 3.0390 1.7125 2.9747 2.1299 2.0674 2.0630 1.8764 2.0953 2.1363 1.7045 2.1296 4.0277 5.7019 3.0788 2.7805 2.7699 3.9885 3.4153 2.7618 3.4446 6.3590 4.7691 4.4554 1.5030 1.3677 2.2173 3.7828 2.1214 1.1356 1.2383 1.2558 1.9080 1.4838 3.7199 1.4312 1.8965 2.3233 3.7190 1.4517 1.6128 2.2718 3.2683 2.7686 2.8854 1.8453 2.1565 1.5319 1.6827 1.3371 1.3978 1.0658 1.1638 1.1177 2.2220 2.2704 1.4682 1.3536 1.1155 1.2227 1.2320 1.2753 1.4014 1.3482 1.3316 1.3247 1.2083 1.3629 6.6180 1.2366 1.2332 1.0950 2.1461 1.0593 1.0533 1.0565 1.1116 1.0581 1.0643 1.0680 2.1507 1.0743 5.9914 6.0136 1.0720 1.0713 1.0705 1.0358 1.0360 1.0739 1.0779 1.0606 1.0857 1.0876 1.0886 1.0981 1.0983 1.0967 1.1003 1.1003 1.1061 1.0863 1.0874 1.0932 1.0976 1.0973 1.0663
irintensity: 0.1303 0.2573 0.4225 0.2840 0.3795 0.2772 0.2221 1.2471 1.0234 1.2744 0.7808 0.6866 16.6514 2.2384 4.1077 27.4343 22.7397 94.4542 2.9279 1.0000 0.7319 6.8411 0.4294 6.0153 24.1744 4.3789 5.9527 1.6051 0.2917 27.1412 23.2853 76.2268 7.9810 10.9157 2.2711 25.4469 5.9218 3.6225 0.0352 2.2796 3.3538 112.9740 1.0636 3.8716 5.9088 0.1553 0.1072 3.7930 6.3406 2.4435 5.2412 53.2627 21.3027 2.0251 6.9675 39.3393 29.0816 2.1373 1.0965 15.3766 1.9554 41.0715 5.4849 14.5198 4.8684 0.4183 20.1387 21.1946 17.9101 6.3591 3.2785 1.4172 2.2500 15.8500 6.9641 0.2016 19.1171 23.5789 8.8067 6.4103 0.8583 5.8819 3.6556 12.4033 2.6770 18.8173 9.8775 13.1543 9.8446 1.1972 3.1259 37.4146 159.4484 75.5190 28.0665 36.4433 38.0696 38.9337 15.2052 15.0270 14.9023 21.9383 65.6536 67.1643 19.4055 25.4852 56.1181 17.7652 7.6855 1.8078 32.5172 36.2200 8.7912 9.5563
temp: 298.150 k
press: 1.00000 atm
elementType: 16 8 7 6 6 6 6 6 6 6 6 6 6 6 6 6 6 1 1 1 1 1 1 1 1 1 1 1 1 1 1 1 1 1 1 1 1 1 1 1
symmnumber: 1
zpe: 897297.6 jmol-1
zpe.correction: 0.341763 hartree
zpe.thermalcorrener: 0.361906 hartree
zpe.thermalcorrenthalpy: 0.362850 hartree
zpe.thermalcorrgfe: 0.288999 hartree
zpe.sumelectzpe: -1073.949990 hartree
zpe.sumelectthermal: -1073.929846 hartree
zpe.sumelectthermalent: -1073.928902 hartree
zpe.sumelectthermalfe: -1074.002754 hartree
dipole: 2.6653 0.0128 1.4826
dipole: 3.0500
quadrupole: -102.6916 -116.4011 -112.4307
quadrupole: 4.3775 -3.4827 -0.2522
quadrupole: 7.8162 -5.8933 -1.9229 4.3775 -3.4827 -0.2522
hfenergy: -1074.2917523 hartree
pointgroup: C01 [X(C14H23N1O1S1)]
dipole: 1.0492891 -0.5816383 0.0239526 debye
polarizability: 253.206284|1.4316043|145.3647675|-10.2539406|13.2909821|156.8930068 unknown
InChI: InChI=1S/C14H23NOS/c1-3-15(4-2)10-11-17-14(12-16)13-8-6-5-7-9-13/h5-9,14,16H,3-4,10-12H2,1-2H3
charge 0 multiplicity 1
40 atoms
S  -0.182141 1.102788 -1.158527
O  -1.358173 0.833367 2.86283
N  3.816848 -0.019311 -0.413155
C  2.533055 0.70525 -0.240455
C  1.465776 0.161796 -1.210293
C  -1.000505 0.325906 0.417489
C  4.561009 -0.232352 0.856317
C  4.658069 0.550764 -1.501104
C  -2.451735 -0.017796 0.112253
C  -0.759096 1.289492 1.597013
C  3.940301 -1.331808 1.739759
C  5.595511 -0.487203 -2.147341
C  -2.734016 -1.118193 -0.740409
C  -3.536485 0.726039 0.640943
C  -4.061824 -1.464616 -1.063837
C  -4.869004 0.38413 0.313463
C  -5.13815 -0.709628 -0.538876
H  2.641739 1.806077 -0.388969
H  2.181648 0.562229 0.797258
H  1.797631 0.260243 -2.258814
H  1.269707 -0.906439 -1.015817
H  -0.424672 -0.609004 0.570677
H  4.652587 0.717384 1.44202
H  5.590443 -0.536479 0.593658
H  3.979922 0.94431 -2.281306
H  5.253892 1.425095 -1.135671
H  -1.227026 2.268505 1.404357
H  0.330827 1.455247 1.714353
H  4.537069 -1.471184 2.660484
H  3.907766 -2.287904 1.189033
H  2.908403 -1.080355 2.047832
H  6.178197 -0.024269 -2.965625
H  5.007194 -1.325199 -2.559687
H  6.315508 -0.903747 -1.419712
H  -1.902073 -1.692083 -1.167501
H  -3.348863 1.554525 1.329699
H  -4.259116 -2.315983 -1.725085
H  -5.696359 0.968169 0.73229
H  -6.171719 -0.973808 -0.789653
H  -1.050546 -0.087655 3.058708
