program: Gaussian 09
title: 000296043
version: EM64L-G09RevD.01
frameworkgroup: C1[X(C13H26ClNO)]
method: RPBEPBE
basis: SDD
operation: Freq
keyword: #p
keyword: freq=noraman
keyword: PBEPBE/SDD
title: #p freq=noraman PBEPBE/SDD
converged: YES YES NO NO
title: Mulliken charges:
elementType: Cl O N C C C C C C C C C C C C C H H H H H H H H H H H H H H H H H H H H H H H H H H
charge: -0.086936 -0.275557 -0.359467 -0.395944 -0.379052 -0.377367 -0.398479 -0.381818 -0.049267 -0.373273 -0.353443 -0.706798 -0.356730 -0.696988 0.287106 -0.664047 0.185237 0.239706 0.195738 0.200428 0.183467 0.194757 0.195105 0.194178 0.200286 0.187807 0.260503 0.190128 0.186950 0.186696 0.189626 0.221499 0.234023 0.202133 0.193668 0.195073 0.309268 0.210305 0.214118 0.209172 0.294140 0.294047
chargesum: 0.00000
title: Mulliken charges with hydrogens summed into heavy atoms:
elementType: Cl O N C C C C C C C C C C C C C
charge: -0.086936 -0.275557 -0.050199 0.028999 0.017115 0.000858 -0.009196 0.006275 0.211235 0.003804 0.022880 -0.049142 0.032011 -0.063393 0.287106 -0.075861
polarizability: 1.91259867e+02 -6.02009770e+00 1.56094762e+02 1.30014096e+01 -2.01034468e-01 1.35667564e+02
1716.lowfreq: -16.2204 -5.4741 -3.6017 -0.0014 -0.0007 0.0008 12.1081 17.0836 26.6478
frequency: 10.2900 14.3753 25.9001 41.6129 44.8297 61.1130 82.9309 86.5544 99.6626 110.0726 120.2568 136.4023 143.6646 169.9417 202.1366 212.8596 220.4894 230.3573 273.4947 288.7131 320.8823 372.7875 402.0198 430.5927 440.8283 466.1532 525.7969 569.7643 575.7487 668.0770 671.1319 720.2555 725.7539 738.2305 771.8060 819.1400 845.2522 867.6563 887.7857 894.9710 905.5851 941.4093 954.7296 981.2730 998.8918 1010.2447 1023.0563 1047.8314 1058.8791 1075.1715 1080.0253 1080.7394 1101.1707 1128.2758 1132.2196 1147.5633 1165.0909 1186.9904 1205.5019 1224.2428 1232.6391 1252.2748 1256.8004 1260.6028 1272.9521 1282.6007 1284.7876 1294.4998 1298.2817 1301.0909 1313.5869 1331.3537 1345.4367 1349.5406 1352.7119 1355.1079 1362.7758 1388.5731 1391.7176 1418.4432 1453.2286 1460.3868 1461.1719 1465.1404 1465.4791 1471.9025 1472.3663 1475.2186 1476.7508 1479.1712 1485.0746 1488.4107 1510.7439 1603.3505 2947.9268 2949.7019 2951.8965 2954.4286 2957.3436 2961.3005 2966.8857 2970.6825 2970.8963 2977.5380 2983.3245 2990.2845 3000.7446 3006.7568 3016.8179 3022.4138 3034.9891 3043.8949 3045.4038 3067.3693 3069.4114 3071.5543 3075.5396 3091.7785 3154.0930 3488.8231
redmass: 2.7734 5.3920 2.6204 3.5824 4.2941 3.0483 2.9549 1.7938 3.0510 2.6976 4.9941 1.8657 2.2005 3.0042 3.9921 1.6863 1.4257 1.1188 3.5890 2.7890 3.1590 6.3415 2.7547 2.9182 2.8057 3.0671 2.5936 3.7323 3.8138 1.2692 4.5012 1.0614 1.0952 1.1893 1.2786 1.4142 2.0158 1.4692 1.8963 1.8575 1.7217 1.3480 2.6016 2.3148 2.6573 1.4607 2.3903 2.8987 1.5855 2.8827 2.2261 2.1884 1.9406 2.4322 2.5985 1.1339 2.2731 1.7303 1.4081 1.3718 1.4505 1.2031 1.5736 1.3072 1.3956 1.0490 1.1839 1.0883 1.1621 1.3106 1.1677 1.4144 1.4548 1.4318 1.5281 1.5387 1.5305 1.2177 1.2159 1.0925 1.0971 1.0751 1.0712 1.0642 1.0786 1.0752 1.0787 1.0493 1.0425 1.0821 1.0886 1.0931 1.8592 9.2822 1.0589 1.0587 1.0592 1.0602 1.0609 1.0613 1.0589 1.0596 1.0378 1.0378 1.0955 1.0969 1.0991 1.1002 1.0996 1.1022 1.1043 1.0890 1.1032 1.1006 1.0993 1.0566 1.0968 1.1001 1.1095 1.0770
irintensity: 0.2514 0.3667 0.1316 0.1266 0.9356 5.4134 2.5605 2.2860 8.7649 1.6820 1.2818 0.0319 0.1799 0.1765 6.8263 1.4398 0.1236 0.0007 8.4837 1.1626 1.4781 4.3885 0.5635 2.7595 0.8965 0.2918 5.3957 6.5522 6.2146 93.2225 88.6110 15.5338 2.5174 9.5247 1.1646 3.9140 2.3875 3.3113 4.7928 2.1487 8.8045 1.5374 0.6260 2.5111 1.3274 1.2201 5.0605 1.2272 3.8936 0.9644 2.1239 1.2668 9.8780 5.8134 13.0402 0.0598 24.5512 1.7358 11.1200 4.1184 1.9775 24.1847 12.0916 0.3805 8.3591 1.1073 0.8329 0.5927 2.7412 0.6041 6.0855 1.0290 3.1416 1.6343 3.5814 0.3093 2.0026 11.3395 17.7020 29.9048 17.9519 0.6286 0.3165 3.7108 0.8354 18.4060 10.4208 12.2708 12.2065 1.3871 3.2443 30.9510 178.9068 202.1448 1.3730 3.8638 0.6767 12.8288 14.8441 45.0782 125.2643 97.2784 26.9963 33.3412 4.1666 4.2664 4.5126 8.0706 17.5712 12.6713 26.2966 17.3402 169.3848 97.0430 56.7304 3.9258 43.3542 32.0648 1.2531 42.0360
temp: 298.150 k
press: 1.00000 atm
elementType: 17 8 7 6 6 6 6 6 6 6 6 6 6 6 6 6 1 1 1 1 1 1 1 1 1 1 1 1 1 1 1 1 1 1 1 1 1 1 1 1 1 1
symmnumber: 1
zpe: 972714.4 jmol-1
zpe.correction: 0.370487 hartree
zpe.thermalcorrener: 0.391417 hartree
zpe.thermalcorrenthalpy: 0.392361 hartree
zpe.thermalcorrgfe: 0.315519 hartree
zpe.sumelectzpe: -1099.718444 hartree
zpe.sumelectthermal: -1099.697514 hartree
zpe.sumelectthermalent: -1099.696570 hartree
zpe.sumelectthermalfe: -1099.773412 hartree
dipole: -1.1678 1.6939 -0.9756
dipole: 2.2770
quadrupole: -108.7039 -103.2974 -112.6409
quadrupole: -5.2995 -2.5222 -0.3275
quadrupole: -0.4898 4.9167 -4.4269 -5.2995 -2.5222 -0.3275
hfenergy: -1100.0889313 hartree
pointgroup: C01 [X(C13H26Cl1N1O1)]
dipole: 0.4343584 -0.7734901 -0.1248323 debye
polarizability: 188.8753977|-12.0086697|153.5226048|-13.7963113|-6.118616|140.6241907 unknown
InChI: InChI=1S/C13H26ClNO/c1-3-4-5-6-7-8-9-10-12(2)15-13(16)11-14/h12,15H,3-11H2,1-2H3
charge 0 multiplicity 1
42 atoms
Cl 4.736287 1.611347 -2.251748
O  1.864633 1.490042 0.646608
N  3.324723 -0.137706 -0.200077
C  -0.280335 -1.359735 0.057887
C  0.853107 -1.824768 -0.885984
C  -1.559093 -0.941585 -0.702894
C  2.119999 -2.330412 -0.156488
C  -2.702931 -0.491566 0.233342
C  2.876237 -1.252031 0.667224
C  -3.9689 -0.029738 -0.523426
C  -5.118131 0.404768 0.413715
C  4.086302 -1.851276 1.415289
C  -6.37748 0.886537 -0.342584
C  -7.522555 1.312364 0.601653
C  2.796121 1.120888 -0.140305
C  3.357732 2.193837 -1.076967
H  -0.526216 -2.179178 0.766371
H  0.067229 -0.500674 0.664626
H  0.472294 -2.641726 -1.532788
H  1.12645 -0.993027 -1.566695
H  -1.910118 -1.786509 -1.332866
H  -1.311698 -0.113833 -1.400049
H  1.841591 -3.148109 0.539204
H  2.826032 -2.77097 -0.891929
H  -2.340427 0.335359 0.8787
H  -2.96788 -1.326045 0.91629
H  2.184234 -0.795485 1.396872
H  -3.704734 0.814298 -1.19466
H  -4.323709 -0.850639 -1.182001
H  -5.392156 -0.442459 1.077054
H  -4.760494 1.21717 1.08076
H  3.752096 -2.645849 2.106202
H  4.610249 -1.07843 2.00427
H  4.810727 -2.303186 0.710068
H  -6.731361 0.076787 -1.013425
H  -6.102577 1.736232 -1.000642
H  4.069788 -0.312838 -0.882768
H  -7.20363 2.140846 1.262243
H  -8.410241 1.652882 0.037075
H  -7.835228 0.470865 1.248599
H  3.79432 3.010652 -0.484178
H  2.556045 2.579299 -1.723175
