program: Gaussian 09
title: 000296042
version: EM64L-G09RevD.01
frameworkgroup: C1[X(C13H10BrCl)]
method: RPBEPBE
basis: SDD
operation: Freq
keyword: #p
keyword: freq=noraman
keyword: PBEPBE/SDD
title: #p freq=noraman PBEPBE/SDD
converged: YES YES NO NO
title: Mulliken charges:
elementType: Br Cl C C C C C C C C C C C C C H H H H H H H H H H
charge: 0.014253 -0.076162 -0.768342 0.540853 0.556476 -0.407607 -0.349784 -0.378569 -0.355086 -0.178910 -0.190198 -0.227568 -0.228819 -0.217346 -0.233341 0.289518 0.241016 0.277122 0.238186 0.253083 0.253029 0.253031 0.231497 0.230458 0.233209
chargesum: 0.00000
title: Mulliken charges with hydrogens summed into heavy atoms:
elementType: Br Cl C C C C C C C C C C C C C
charge: 0.014253 -0.076162 -0.478824 0.540853 0.556476 -0.166591 -0.072662 -0.140383 -0.102003 0.074119 0.062833 0.003929 0.001639 -0.217346 -0.000132
polarizability: 2.38447742e+02 -1.53327081e+00 1.30058411e+02 -1.25597465e+01 4.07513450e+00 1.24032598e+02
1716.lowfreq: -5.3603 0.0010 0.0017 0.0019 1.3281 6.9750 20.3198 34.9624 45.7512
frequency: 20.1395 34.9600 45.7470 95.3929 115.1165 144.8790 194.4670 221.4145 261.8049 297.0980 331.9336 364.0253 400.4548 405.4263 485.1531 492.7404 590.0892 612.8356 614.2417 640.0510 678.8970 699.5571 718.7494 778.7994 787.4758 834.3135 843.8838 851.4786 854.1423 930.7402 955.9810 975.6076 980.6392 990.6716 995.6861 1000.2374 1026.8633 1061.8945 1086.3326 1110.0855 1171.4458 1174.5262 1182.1779 1188.6183 1192.8124 1214.1914 1278.0355 1300.7280 1334.8903 1372.0896 1387.3222 1393.4590 1442.5765 1472.3759 1482.4506 1578.0380 1592.1336 1595.9614 1610.4161 3069.6134 3123.0006 3131.4223 3132.2545 3143.9964 3148.8326 3155.6128 3168.1795 3171.0045 3174.1736
redmass: 4.4076 5.8956 4.3856 8.2188 10.5503 7.7674 9.4196 6.1102 5.6925 5.2109 6.0682 8.0053 2.8058 2.9063 3.5095 3.8945 5.0450 6.1670 6.2674 5.9677 5.3224 1.6545 3.9947 2.0855 2.8312 1.3121 2.6725 1.4074 1.9450 1.4404 1.3518 1.3630 1.4149 5.6422 4.9622 1.3242 2.2332 2.5995 1.6077 1.3958 1.1360 1.0909 2.6549 1.1108 1.1678 1.5343 1.9737 1.3765 1.4645 5.0582 5.8707 2.8933 2.1780 2.4197 2.2736 7.2043 6.0337 6.1738 6.0345 1.0869 1.0868 1.0871 1.0899 1.0920 1.0891 1.0955 1.1013 1.0956 1.0964
irintensity: 0.0733 0.0932 0.2111 1.1878 1.1922 0.9875 0.7893 1.4289 4.3920 1.0452 9.4493 17.7112 0.3226 0.5792 13.3407 1.4842 42.2737 2.0656 18.8697 23.5925 43.1980 72.1235 3.9166 20.5267 50.4752 2.2195 51.9450 1.9354 8.1290 1.2072 0.3923 0.2900 0.1196 5.7007 51.2872 0.0378 5.8007 32.0732 6.2060 8.5780 12.0325 3.2590 16.1884 1.4665 2.5357 5.2645 24.7449 2.5705 2.8750 0.5365 3.0833 10.6905 17.1682 57.6413 13.3595 3.7026 3.5829 21.3808 0.8000 5.7727 3.9697 0.4309 7.2634 15.6992 3.4812 27.2836 20.8311 6.4725 0.6308
temp: 298.150 k
press: 1.00000 atm
elementType: 35 17 6 6 6 6 6 6 6 6 6 6 6 6 6 1 1 1 1 1 1 1 1 1 1
symmnumber: 1
zpe: 489944.6 jmol-1
zpe.correction: 0.186610 hartree
zpe.thermalcorrener: 0.199922 hartree
zpe.thermalcorrenthalpy: 0.200866 hartree
zpe.thermalcorrgfe: 0.143131 hartree
zpe.sumelectzpe: -973.861373 hartree
zpe.sumelectthermal: -973.848061 hartree
zpe.sumelectthermalent: -973.847117 hartree
zpe.sumelectthermalfe: -973.904852 hartree
dipole: -1.6937 -1.9384 1.1724
dipole: 2.8285
quadrupole: -101.7508 -108.4473 -95.1947
quadrupole: 7.2600 -4.6384 3.8560
quadrupole: 0.0468 -6.6497 6.6029 7.2600 -4.6384 3.8560
hfenergy: -974.0479835 hartree
pointgroup: C01 [X(C13H10Br1Cl1)]
dipole: -0.7130727 -0.6862965 0.5088432 debye
dipolederiv: -0.6722365 0.2387384 0.1514863 0.2834503 -0.1442606 -0.0604148 0.1733017 -0.0591029 -0.1071405 -0.4065402 0.0750127 -0.0115154 -0.094344 -0.8393677 0.0941502 0.0706426 0.2716954 -0.2116945 0.7743178 0.0067016 0.0124053 0.0210653 1.0524809 -0.1342176 0.0110907 -0.2669438 0.2743074 0.0642101 -0.0277511 0.0040166 -0.0060698 -0.1646417 0.0183529 -0.0389671 0.0780516 -0.0823493 -0.2573295 -0.0525369 -0.0145599 0.2080459 -0.1096859 -0.0173252 -0.1194105 -0.029487 -0.0420181 -0.0309262 -0.0402152 -0.0823082 -0.0301872 -0.1144308 -0.0171342 0.1095819 -0.091468 0.0598255 -0.0612002 -0.0576498 0.0305425 -0.1234954 -0.0465265 -0.0552993 -0.0891538 0.012774 0.0077151 -0.074249 0.0529503 0.0020859 -0.0443228 -0.0013074 0.1423178 -0.1196465 0.0699618 -0.006816 -0.0305789 -0.0308155 -0.0553577 -0.0004618 -0.0721958 0.0098147 -0.0313535 0.0681549 -0.0711642 -0.3415602 0.0757354 0.1791162 0.0653096 -0.090857 -0.0976997 0.1240576 -0.0608117 -0.0528197 -0.3896457 0.1367469 -0.0298646 0.150152 -0.1349927 -0.0235459 0.019795 -0.0522816 0.0489319 0.0274134 -0.0111092 -0.1283411 -0.0601896 -0.1371454 0.035528 -0.128557 0.0040788 -0.0297806 -0.1359278 -0.0101181 0.0007889 0.0303543 0.0062932 0.1427502 0.0402386 0.1543894 0.0003992 1.1168798 -0.5052294 -0.3003495 -0.5584025 0.1074512 0.098137 -0.3086106 0.0973315 0.1159431 0.0161392 0.093483 -0.0076193 0.0963266 -0.0396962 0.0635423 0.0003807 0.0598499 -0.0798403 0.0134278 0.0368908 -0.0007842 -0.0326372 -0.0288663 0.0325611 0.0137295 -0.0054457 -0.0777681 0.0709183 0.0302842 0.0921149 0.0414605 0.1206168 -0.0002131 0.0788518 0.0085694 -0.0531079 0.0722577 0.05594 -0.0490555 0.0678904 0.0954362 0.0461212 -0.0629797 0.0249728 0.0495399 0.105775 -0.0298856 -0.0177741 -0.0113498 0.0112963 -0.1211481 0.0046705 -0.1025298 0.0238383 0.0361846 0.0177884 0.0905226 0.0604278 0.1039244 -0.0196046 0.1260477 -0.0315883 0.0518738 0.0446611 0.0662772 -0.0562491 0.0709806 0.1147768 0.0557156 -0.0541413 0.0524474 0.0342372 0.0860442 0.0176132 0.0549253 0.0346092 0.1361427 0.0170221 0.0648779 0.0164544 -0.026215 -0.05884 -0.0072471 0.1142687 -0.0067371 0.1155776 -0.0427819 0.1241309 -0.0401034 0.0417461 0.0831169 -0.0162647 0.024313 -0.0370665 0.0128945 -0.1245367 -0.0047469 -0.1352299 0.0159892 -0.0523117 -0.1153395 -0.0028077 -0.1248087 0.0470834 -0.0420919 -0.00383 -0.0437392 0.1163676 unknown
polarizability: 229.4820442|-16.0033586|132.0875941|-28.0479445|9.0103296|130.9691124 unknown
InChI: InChI=1S/C13H10BrCl/c14-12-8-6-11(7-9-12)13(15)10-4-2-1-3-5-10/h1-9,13H
charge 0 multiplicity 1
25 atoms
Br 5.127237 -1.217009 -1.00166
Cl -0.819742 2.88048 -0.281392
C  -0.468393 1.187159 0.6217
C  0.887332 0.661037 0.194972
C  -1.65901 0.27846 0.396456
C  1.701176 0.032335 1.170847
C  1.357307 0.733373 -1.139609
C  -2.799131 0.43067 1.229763
C  -1.675034 -0.715807 -0.614645
C  2.951174 -0.529803 0.827367
C  2.606386 0.18264 -1.499708
C  -3.934373 -0.38692 1.052991
C  -2.811926 -1.534253 -0.792818
C  3.387792 -0.449212 -0.510072
C  -3.944753 -1.372433 0.037455
H  -0.43836 1.516643 1.67246
H  1.360958 -0.028619 2.211313
H  0.759098 1.254938 -1.893529
H  -2.797125 1.202627 2.009079
H  -0.79671 -0.859655 -1.251664
H  3.570411 -1.012257 1.588632
H  2.965316 0.252022 -2.530496
H  -4.807045 -0.258156 1.702528
H  -2.812466 -2.300327 -1.576022
H  -4.82492 -2.009932 -0.101547
