program: Gaussian 09
title: 000296036
version: EM64L-G09RevD.01
frameworkgroup: C1[X(C12H13NO2)]
method: RPBEPBE
basis: SDD
operation: Freq
keyword: #p
keyword: freq=noraman
keyword: PBEPBE/SDD
title: #p freq=noraman PBEPBE/SDD
converged: YES YES NO NO
title: Mulliken charges:
elementType: O O N C C C C C C C C C C C C H H H H H H H H H H H H H
charge: -0.192912 -0.192908 -0.351466 -0.511522 -0.511522 0.236113 0.142350 0.142348 0.380820 0.380822 -0.425820 -0.425819 -0.830018 -0.830020 -0.224045 0.264268 0.265369 0.264275 0.265361 0.234658 0.234658 0.229893 0.270729 0.228290 0.229891 0.270729 0.228289 0.227190
chargesum: 0.00000
title: Mulliken charges with hydrogens summed into heavy atoms:
elementType: O O N C C C C C C C C C C C C
charge: -0.192912 -0.192908 -0.351466 0.018115 0.018114 0.236113 0.142350 0.142348 0.380820 0.380822 -0.191163 -0.191161 -0.101107 -0.101110 0.003145
polarizability: 1.67771719e+02 -1.52566400e-04 1.37787611e+02 2.35601488e-04 2.71257223e+00 1.00716511e+02
1716.lowfreq: -8.3354 -0.0009 -0.0006 -0.0005 7.0338 8.3747 42.9262 74.4237 80.4795
frequency: 42.8970 74.4099 80.4698 85.3446 127.3288 129.5325 143.0286 164.5256 220.6180 230.3032 308.2253 321.7563 341.1448 435.6264 468.1004 507.2854 520.7584 525.5621 541.0145 562.1026 568.3119 614.5062 625.4191 651.6546 743.6373 746.8105 781.4551 824.8413 898.7464 907.4868 919.2371 980.9281 989.5883 1008.1421 1010.3614 1024.0961 1045.3050 1050.3747 1052.7960 1093.6775 1141.2108 1158.8081 1162.7189 1179.8394 1209.3163 1253.8439 1262.1549 1273.8353 1291.3592 1333.6500 1371.6498 1397.4132 1398.7739 1439.2370 1445.7118 1455.0215 1456.9251 1469.5392 1469.9226 1487.0811 1489.5061 1603.3246 1606.2486 1635.5047 1700.2053 2980.0362 2980.5644 3024.7769 3034.0394 3060.4221 3060.5352 3077.8606 3090.4576 3090.8237 3095.5741 3124.9268 3136.1659 3158.5510
redmass: 4.5301 4.3833 3.9792 1.8767 5.5048 1.6162 1.0874 1.7587 3.5520 3.4487 4.1876 3.4285 3.9071 7.2684 3.0066 4.1360 3.0466 4.3112 3.4391 5.7074 4.0659 2.9823 7.5375 5.7246 3.9338 5.9652 1.2200 1.5473 1.3117 5.8069 2.6212 1.3608 1.6294 4.0096 2.1916 2.2621 1.7718 1.5284 1.7580 1.8475 1.2211 4.3745 9.7815 1.1652 1.1162 2.1138 1.5755 2.6000 1.5053 4.6200 7.4925 1.2396 1.2370 1.0716 2.4624 1.0952 1.9750 1.0685 1.0506 1.2279 1.2801 5.7690 7.8874 11.9299 12.3048 1.0371 1.0371 1.0595 1.0641 1.0978 1.0978 1.1027 1.0987 1.0986 1.1014 1.0857 1.0920 1.0996
irintensity: 0.0211 2.4158 6.4450 0.1312 4.3055 5.7362 0.1029 2.5384 1.6053 2.0542 4.6098 1.1744 0.6274 13.5167 0.0085 0.6016 0.0666 1.5909 0.0060 3.9065 1.4059 0.6313 10.9312 51.3396 1.8240 0.4201 51.2495 15.0482 0.0684 26.1559 3.6948 0.1138 3.2449 0.6957 0.8050 11.1032 2.4600 0.6631 19.9175 2.9965 0.5353 40.1389 247.8947 2.1360 0.0032 29.7803 0.8076 1.7251 0.0018 201.6522 5.0563 25.8099 1.8188 1.1713 16.0209 29.9561 0.9779 45.9362 0.2334 32.6161 39.3503 1.8962 15.4744 487.1980 4.1864 37.7520 8.0674 13.1757 2.9606 3.4782 19.6243 0.2553 19.7406 24.4716 6.5140 0.1326 22.5370 30.8128
temp: 298.150 k
press: 1.00000 atm
elementType: 8 8 7 6 6 6 6 6 6 6 6 6 6 6 6 1 1 1 1 1 1 1 1 1 1 1 1 1
symmnumber: 1
zpe: 586020.3 jmol-1
zpe.correction: 0.223203 hartree
zpe.thermalcorrener: 0.237248 hartree
zpe.thermalcorrenthalpy: 0.238192 hartree
zpe.thermalcorrgfe: 0.182069 hartree
zpe.sumelectzpe: -669.226655 hartree
zpe.sumelectthermal: -669.212610 hartree
zpe.sumelectthermalent: -669.211666 hartree
zpe.sumelectthermalfe: -669.267789 hartree
dipole: 1.7305 0.0000 0.0000
dipole: 1.7305
quadrupole: -69.2793 -86.5275 -99.6195
quadrupole: 0.0000 -0.0001 12.9735
quadrupole: 15.8628 -1.3854 -14.4774 0.0000 -0.0001 12.9735
hfenergy: -669.4498584 hartree
pointgroup: C01 [X(C12H13N1O2)]
dipole: 0.6808242 0.0000401 0.0000217 debye
polarizability: 167.7717191|0.0025237|134.3500874|0.0021444|-11.0893759|104.1540347 unknown
InChI: InChI=1S/C12H13NO2/c1-8-4-3-5-9(2)12(8)13-10(14)6-7-11(13)15/h3-5H,6-7H2,1-2H3
charge 0 multiplicity 1
28 atoms
O  1.185126 0.683834 -2.249346
O  1.185079 -0.683686 2.249204
N  0.851057 0.000018 -0.000091
C  3.116783 0.248515 -0.731328
C  3.116774 -0.24808 0.731315
C  -0.599683 -0.000045 -0.000125
C  1.64135 0.349228 -1.13354
C  1.641327 -0.349139 1.13339
C  -1.283749 -1.245476 0.042766
C  -1.283864 1.245324 -0.043047
C  -2.699413 -1.221952 0.043241
C  -2.699526 1.221667 -0.043592
C  -0.533941 -2.562923 0.086716
C  -0.534179 2.562842 -0.086954
C  -3.403887 -0.000175 -0.000193
H  3.63099 -0.434064 -1.428772
H  3.583619 1.241612 -0.851215
H  3.630761 0.434619 1.428803
H  3.583828 -1.241069 0.851248
H  -3.247323 -2.170525 0.074838
H  -3.247523 2.17019 -0.075214
H  0.239468 -2.619557 -0.701686
H  -0.027738 -2.694861 1.060889
H  -1.224922 -3.410527 -0.055013
H  0.239205 2.619536 0.701468
H  -0.027965 2.694843 -1.061112
H  -1.225243 3.410379 0.054771
H  -4.499509 -0.000227 -0.000219
