program: Gaussian 09
title: 000296032
version: EM64L-G09RevD.01
frameworkgroup: C1[X(C11H8INO2)]
method: RPBEPBE
basis: SDD
operation: Freq
keyword: #p
keyword: freq=noraman
keyword: PBEPBE/SDD
title: #p freq=noraman PBEPBE/SDD
converged: YES YES NO NO
title: Mulliken charges:
elementType: I O O N C C C C C C C C C C C H H H H H H H H
charge: 0.129971 -0.330724 -0.249229 0.033267 0.326209 0.226589 -0.217534 0.403536 -0.295734 -0.302307 -0.671556 0.131412 -0.183085 -0.368199 -0.795316 0.260791 0.324079 0.234087 0.248831 0.268279 0.240290 0.240308 0.346035
chargesum: 0.00000
title: Mulliken charges with hydrogens summed into heavy atoms:
elementType: I O O N C C C C C C C C C C C
charge: 0.129971 0.015311 -0.249229 0.033267 0.326209 0.226589 -0.217534 0.403536 -0.034943 0.021772 -0.671556 0.131412 0.051002 -0.119368 -0.046439
polarizability: 2.48610040e+02 8.44971612e+00 1.90477128e+02 3.65728663e-02 -7.18785103e-02 5.87310237e+01
1716.lowfreq: -6.3642 -5.4977 -0.0001 0.0003 0.0007 2.2034 39.9468 58.9488 104.4246
frequency: 39.9414 58.9450 104.4238 118.5445 120.4136 175.6119 182.4324 231.6980 238.0957 298.6851 317.6556 335.6889 370.8949 424.7166 479.2461 480.2317 511.2266 540.5398 542.7280 581.9733 614.8937 659.4234 668.0865 685.8927 711.2407 823.3658 826.5024 842.9682 890.1731 901.4735 959.0940 986.0995 1021.3463 1026.6842 1038.0730 1050.5730 1121.0555 1175.0162 1196.8301 1235.0367 1259.7653 1264.9357 1329.6129 1366.8580 1373.4665 1384.0272 1406.3357 1445.1787 1454.6738 1469.6826 1490.7901 1527.4295 1558.4697 1577.6561 1592.0452 2987.4247 3073.8431 3125.8130 3126.0898 3159.5806 3181.9311 3190.4074 3416.3961
redmass: 4.5922 7.1839 5.8005 4.9519 7.5353 1.0558 12.0629 4.3230 6.3062 5.2718 7.0007 6.7612 5.1493 3.8530 8.0838 2.2795 1.3782 3.4924 4.1347 7.3605 5.3456 3.4704 4.6401 6.6539 7.0117 1.6137 6.0028 3.7564 1.4103 4.7504 1.4398 2.1411 1.7462 1.3537 3.5994 2.4603 2.0505 1.8916 1.7760 1.6804 7.1825 1.9387 4.5202 1.4226 2.1456 2.0452 3.3589 2.2300 1.4075 1.0498 4.1955 7.2878 6.5165 6.6609 7.0305 1.0378 1.0977 1.0987 1.0898 1.0941 1.0909 1.0963 1.0646
irintensity: 4.6715 1.6498 0.4180 2.1591 0.5959 1.5229 0.2504 4.4709 8.1030 4.7047 3.0870 2.7003 7.0600 4.5021 1.9286 16.7356 95.9298 0.2090 11.1180 34.8208 3.5008 0.5849 19.9911 5.3985 42.2797 38.2588 32.5939 13.3813 15.7460 17.6378 0.4213 26.6681 2.0525 4.2259 31.7222 69.2953 74.9800 31.7131 124.8877 19.4771 234.7162 67.5567 19.8790 59.7084 23.8447 11.0753 3.4245 44.9936 5.9727 20.5490 154.6730 190.0782 19.5498 80.1777 4.4914 3.0052 11.8128 12.5783 21.0234 22.0343 0.8045 20.2654 90.6216
temp: 298.150 k
press: 1.00000 atm
elementType: 53 8 8 7 6 6 6 6 6 6 6 6 6 6 6 1 1 1 1 1 1 1 1
symmnumber: 1
zpe: 426767.4 jmol-1
zpe.correction: 0.162547 hartree
zpe.thermalcorrener: 0.175802 hartree
zpe.thermalcorrenthalpy: 0.176746 hartree
zpe.thermalcorrgfe: 0.120828 hartree
zpe.sumelectzpe: -639.622560 hartree
zpe.sumelectthermal: -639.609306 hartree
zpe.sumelectthermalent: -639.608362 hartree
zpe.sumelectthermalfe: -639.664279 hartree
dipole: 2.0198 1.3852 0.0258
dipole: 2.4493
quadrupole: -94.1524 -103.1337 -103.7545
quadrupole: 8.7945 -0.1021 0.0659
quadrupole: 6.1945 -2.7868 -3.4076 8.7945 -0.1021 0.0659
hfenergy: -639.7851074 hartree
pointgroup: C01 [X(C11H8I1N1O2)]
dipole: -0.0199518 -0.9509722 -0.1544482 debye
dipolederiv: -0.1814122 -0.2054607 -0.0145345 -0.2195477 -0.4273378 -0.0614957 -0.0166852 -0.0623898 0.0340495 -1.4716401 -0.0872923 0.0926231 0.0318241 -0.1658258 0.027683 0.1141807 0.0389055 -0.343243 -1.1380488 -0.1181828 0.0602955 -0.3697542 -0.6633791 -0.0218266 0.0164538 -0.0470371 -0.3206812 -0.2889345 -0.0423698 -0.0012308 0.075231 -0.5216076 -0.0601135 0.0193407 -0.0490524 -0.2310387 -0.1003808 -0.1148396 -0.0032079 -0.1812911 0.1540291 0.0301903 -0.0121701 0.0238204 0.0865423 -1.1192862 -0.016825 0.0994369 0.1262549 -0.1281838 -0.0252376 0.1220085 -0.0122619 -0.0579207 -0.1024935 0.2468884 0.0555573 -0.3152218 0.3392579 0.0857317 -0.0433226 0.0322216 0.0339945 1.2646473 -0.2630129 -0.1536559 -0.2995637 -0.0572861 -0.0058366 -0.1607009 -0.009342 0.1529159 0.4662527 -0.0258576 -0.0518068 -0.0866411 -0.3126617 -0.0413253 -0.0650171 -0.0461737 -0.0309736 0.0651873 0.0681932 -0.0046834 0.0606666 -0.0397198 0.0073492 -0.0064464 0.005995 -0.1103915 -0.2118764 0.6478723 0.1098224 1.0785411 0.6871998 0.0609076 0.1856534 0.1012486 -0.2492139 1.967193 -0.1464883 -0.2017147 -0.1611927 0.8049929 0.1249303 -0.2016983 0.1250869 0.1653027 -0.0358616 0.2508425 0.0382029 0.1252605 -0.0280654 0.0009255 0.0154074 -0.0111137 -0.1028328 0.2217276 -0.2352192 -0.0676859 -0.1381124 0.297792 0.0749671 -0.0504188 0.0839892 -0.032656 -0.1322606 0.1569439 0.0430589 0.3116894 -0.4049713 -0.1049907 0.0702262 -0.0906864 0.0245727 0.1247498 0.0473638 0.0097706 0.0672673 -0.0013556 -0.0305048 0.0132937 -0.0287408 0.1291802 0.0957293 -0.085697 -0.0100136 0.0076198 0.1887523 0.005668 0.0068674 0.015046 0.154012 0.0528377 -0.0999028 -0.0078223 -0.0772021 -0.0724385 -0.0330384 -0.0039139 -0.0309496 0.1507093 0.0470057 0.0923981 0.0240208 0.06903 -0.1023794 -0.0472354 0.0201658 -0.049429 0.11716 -0.1028884 0.0317879 0.0249857 -0.0490796 0.0976088 0.0004424 0.0109165 -0.0063814 0.1197921 0.0584499 -0.0264909 -0.1026298 -0.0005281 0.0651416 -0.0461027 -0.0643398 -0.0552457 -0.0279784 0.082852 -0.0439582 0.0750338 -0.0092968 0.0217547 0.0689053 0.046595 0.0837964 -0.0101501 0.4384507 -0.030693 -0.0138221 -0.0459534 0.2686826 -0.0099931 -0.016396 -0.0113062 0.3488487 unknown
polarizability: 200.9966869|26.6811969|232.3425797|-8.9169327|27.9066278|64.4789255 unknown
InChI: InChI=1S/C11H8INO2/c1-6(14)8-5-9(12)11(15)10-7(8)3-2-4-13-10/h2-5,15H,1H3
charge 0 multiplicity 1
23 atoms
I  -2.282896 -3.338241 -0.549301
O  -3.138695 -0.190041 0.084581
O  3.390896 0.360435 -0.45195
N  -1.671635 2.0557 0.340187
C  0.460704 0.825551 -0.081308
C  1.100011 -0.449152 -0.366678
C  -0.980977 0.890484 0.068294
C  -1.777434 -0.317164 -0.068314
C  0.285228 -1.591334 -0.490136
C  1.167526 2.067397 0.07114
C  -1.119047 -1.530553 -0.344925
C  2.582038 -0.615528 -0.536028
C  0.46092 3.24095 0.346135
C  -0.959283 3.190769 0.47263
C  3.147228 -2.010618 -0.819353
H  0.742273 -2.559044 -0.705071
H  2.253564 2.06226 -0.033645
H  0.98511 4.194356 0.465107
H  -1.53543 4.098467 0.688105
H  4.240852 -1.920545 -0.898736
H  2.756677 -2.427453 -1.765986
H  2.907063 -2.723149 -0.00896
H  -3.585195 -1.07595 -0.02849
