program: Gaussian 09
title: 000296031
version: EM64L-G09RevD.01
frameworkgroup: C1[X(C11H15N)]
method: RPBEPBE
basis: SDD
operation: Freq
keyword: #pfreq=noraman
keyword: PBEPBE/SDD
title: #p freq=noraman PBEPBE/SDD
converged: YES YES NO NO
title: Mulliken charges:
elementType: N C C C C C C C C C C C H H H H H H H H H H H H H H H
charge: -0.048920 -0.342429 -0.344600 -0.434099 -0.686887 0.426298 -0.339926 -0.380250 -0.373735 -0.227725 -0.221177 -0.232522 0.187523 0.209649 0.219459 0.184440 0.164343 0.225420 0.211660 0.205140 0.215209 0.198863 0.226251 0.274349 0.227327 0.227386 0.228956
chargesum: 0.00000
title: Mulliken charges with hydrogens summed into heavy atoms:
elementType: N C C C C C C C C C C C
charge: -0.048920 0.054742 0.059298 -0.044336 -0.054878 0.426298 -0.141063 -0.154000 -0.099386 -0.000398 0.006210 -0.003566
polarizability: 1.88073847e+02 2.19622318e+01 9.45499883e+01 1.45084096e+01 -1.46788161e+01 1.08902153e+02
1716.lowfreq: -26.9291 -9.3535 -0.0007 -0.0007 -0.0004 8.3830 28.5821 40.6805 63.2478
frequency: 23.8875 40.4557 63.1861 104.5552 113.5411 170.5657 225.4539 236.7193 281.0549 302.8663 351.3732 407.0856 415.6322 488.8072 542.7238 614.9448 625.4274 701.3388 735.5235 770.4458 826.7094 833.1115 849.6829 859.5454 925.3058 941.6475 962.3538 983.2133 988.1912 988.6952 1006.9555 1021.1813 1027.2946 1068.0274 1081.5501 1116.1661 1134.9616 1171.1697 1179.1271 1212.6500 1232.1411 1237.5396 1287.1749 1299.0980 1309.5902 1329.8967 1354.5487 1367.2086 1388.2056 1395.1345 1439.5406 1449.7814 1461.5934 1473.2074 1476.9054 1481.6643 1485.1460 1584.5778 1611.0174 1629.4763 2882.5929 2905.1827 2966.4392 2971.8009 2976.4347 3007.2437 3018.5555 3044.8658 3069.7466 3072.5069 3115.6300 3127.8958 3141.6290 3156.2501 3167.0055
redmass: 3.7349 3.7571 1.5846 4.1421 3.2943 3.0048 1.1645 2.4010 2.8628 3.8412 3.2142 2.8313 3.3024 2.8585 2.8609 6.4387 5.0678 1.7956 1.1520 1.6712 1.9899 2.4263 2.0032 1.2499 1.4535 1.7732 1.4166 1.5007 1.5588 4.3610 1.3520 2.4188 3.0211 2.3424 1.6247 2.0160 1.8455 1.0671 1.1107 1.3112 1.9629 1.3467 1.1476 1.2456 1.4090 1.2585 1.5400 1.8675 1.2149 3.7052 2.1761 1.0889 1.1076 1.0593 1.0440 2.4011 1.0756 6.3488 6.0403 7.1144 1.0681 1.0842 1.0601 1.0385 1.0613 1.0901 1.0954 1.1026 1.1007 1.0995 1.0873 1.0868 1.0919 1.0959 1.1004
irintensity: 0.5737 0.1134 0.0487 0.1899 2.3684 12.0975 0.6734 0.9347 7.2049 3.9111 2.9266 0.1138 0.8753 18.3916 2.0924 0.0326 8.8644 50.8688 6.7348 49.4173 3.9840 0.5103 5.4938 0.0826 2.3521 4.2437 2.1995 18.3297 3.3053 1.1090 3.3313 4.2283 5.1914 5.2104 6.7165 1.6534 5.7327 1.6741 4.9623 3.5663 9.2690 1.1961 0.2319 2.0780 18.2443 6.2824 5.3513 2.8787 10.5758 2.6921 10.8848 14.4357 16.9951 3.7859 11.5631 8.8242 11.4398 11.4897 4.6567 56.3383 83.6070 91.7343 23.8332 27.2911 67.8046 45.2719 5.6850 25.4877 89.0317 52.2139 8.6281 0.8232 25.4074 24.2552 22.6541
temp: 298.150 k
press: 1.00000 atm
elementType: 7 6 6 6 6 6 6 6 6 6 6 6 1 1 1 1 1 1 1 1 1 1 1 1 1 1 1
symmnumber: 1
zpe: 605970.5 jmol-1
zpe.correction: 0.230802 hartree
zpe.thermalcorrener: 0.243034 hartree
zpe.thermalcorrenthalpy: 0.243978 hartree
zpe.thermalcorrgfe: 0.190528 hartree
zpe.sumelectzpe: -482.004373 hartree
zpe.sumelectthermal: -481.992142 hartree
zpe.sumelectthermalent: -481.991197 hartree
zpe.sumelectthermalfe: -482.044647 hartree
dipole: 0.0979 -0.4811 1.1406
dipole: 1.2418
quadrupole: -64.7768 -72.6313 -70.9371
quadrupole: 4.4035 1.2912 -4.2439
quadrupole: 4.6716 -3.1829 -1.4887 4.4035 1.2912 -4.2439
hfenergy: -482.2351753 hartree
pointgroup: C01 [X(C11H15N1)]
dipole: -0.0474705 -0.2763052 -0.4001205 debye
polarizability: 186.8984838|-21.1222677|102.2912955|19.1181681|15.7669335|102.3362088 unknown
InChI: InChI=1S/C11H15N/c1-2-3-9-12-10-11-7-5-4-6-8-11/h4-8,10H,2-3,9H2,1H3
charge 0 multiplicity 1
27 atoms
N  1.052486 -0.684068 0.911833
C  3.509274 -0.376526 0.681894
C  3.498007 0.338412 -0.686673
C  2.348413 -1.386799 0.853458
C  4.670819 1.32954 -0.847264
C  -1.202232 -0.340164 0.032437
C  0.124033 -0.995645 0.049391
C  -2.164925 -0.736072 -0.934262
C  -1.535266 0.680863 0.965584
C  -3.437917 -0.125777 -0.970897
C  -2.804913 1.289275 0.927434
C  -3.760936 0.888661 -0.040326
H  4.467917 -0.918745 0.812621
H  3.445401 0.373868 1.49395
H  2.53758 0.876248 -0.80535
H  3.537924 -0.420061 -1.496109
H  2.392567 -2.148038 0.03595
H  2.480783 -1.914988 1.818832
H  4.634291 2.112152 -0.066221
H  5.645503 0.81285 -0.758854
H  4.642841 1.832719 -1.83122
H  0.282449 -1.779402 -0.728113
H  -1.912939 -1.523843 -1.655959
H  -0.780371 0.971378 1.703539
H  -4.17429 -0.437901 -1.719774
H  -3.056392 2.075595 1.648167
H  -4.748009 1.364066 -0.066868
