program: Gaussian 09
title: 000296041
version: EM64L-G09RevD.01
frameworkgroup: C1[X(C13H17N3O4)]
method: RPBEPBE
basis: SDD
operation: Freq
keyword: #p
keyword: freq=noraman
keyword: PBEPBE/SDD
title: #p freq=noraman PBEPBE/SDD
converged: YES YES NO NO
title: Mulliken charges:
elementType: O O O O N N N C C C C C C C C C C C C C H H H H H H H H H H H H H H H H H
charge: -0.249819 -0.232252 -0.294730 -0.363848 -0.394447 -0.105096 -0.637939 -0.057015 0.279320 -0.175477 -0.400654 0.219315 0.242877 0.168732 -0.263425 -0.261195 -0.117345 -0.361964 -0.670830 -0.670682 0.332153 0.386459 0.242304 0.231113 0.217936 0.231117 0.222219 0.233017 0.223163 0.251755 0.226289 0.211151 0.249233 0.230215 0.213635 0.314878 0.329839
chargesum: 0.00000
title: Mulliken charges with hydrogens summed into heavy atoms:
elementType: O O O O N N N C C C C C C C C C C C C C
charge: -0.249819 -0.232252 -0.294730 -0.363848 -0.007988 -0.105096 0.006777 -0.057015 0.279320 0.156675 -0.158350 0.219315 0.242877 0.168732 0.185624 0.192142 0.115672 -0.138801 0.018365 0.022401
polarizability: 3.35221820e+02 -1.82247023e+00 2.06203452e+02 -5.56283898e-01 -1.17684930e+01 9.48797341e+01
1716.lowfreq: -11.0830 -4.4393 0.0007 0.0008 0.0009 2.8984 4.9967 25.8551 39.1494
frequency: -10.9373 25.8334 39.1407 45.6079 58.6053 68.2039 87.7483 92.3857 106.6706 132.8053 164.6892 188.3042 208.8281 220.1399 221.1581 248.2379 261.7924 301.7428 323.5094 338.3455 379.5586 380.6054 408.4753 423.8238 443.2572 449.4095 456.8880 504.6884 506.8977 547.1362 570.7968 656.6433 662.2041 683.4241 697.1360 719.3325 746.3886 747.5178 768.8334 789.7851 809.7189 819.9536 822.9775 847.6876 865.1257 940.0388 947.8031 960.4612 968.7696 994.4575 1011.6893 1035.9517 1036.7634 1071.4755 1093.9782 1095.1904 1100.0924 1152.1486 1153.9144 1174.0528 1177.0520 1219.1492 1237.6891 1277.3711 1278.3714 1308.3123 1327.8984 1341.3282 1354.5654 1364.3557 1369.1558 1386.3179 1387.4649 1419.2229 1440.2370 1453.0364 1454.6592 1460.9987 1461.7260 1477.5628 1485.4466 1485.7843 1546.3958 1557.1433 1576.6509 1594.9417 1618.9356 1639.6399 2990.1066 2991.7747 3026.9302 3031.1105 3084.6886 3087.0617 3091.2898 3094.2458 3117.0785 3119.9879 3140.5503 3157.8270 3167.5771 3173.2458 3203.0515 3555.1852 3709.5686
redmass: 4.3212 4.3515 3.7732 3.7765 4.1602 4.6509 4.3209 4.0147 7.7707 2.5397 2.9862 3.8514 1.7325 1.3755 4.0791 4.1969 2.7933 5.1187 2.9176 3.5617 3.1438 1.1859 3.5390 3.4357 11.4604 2.7371 3.7421 4.4748 1.2247 6.2898 6.6996 4.8852 4.5901 11.0709 4.7995 1.6166 7.7863 2.7270 3.2427 2.7603 1.3663 1.5903 3.2938 1.4668 3.2322 4.0541 1.3545 2.7098 1.3268 2.6427 2.8780 4.6487 1.1923 2.0387 2.1429 2.1028 1.6766 1.6864 1.6671 1.8995 1.7541 1.6121 3.0591 1.1260 1.1185 2.1709 2.2363 1.9770 1.5698 2.1915 2.4254 1.2442 1.2374 4.0137 4.1335 1.1503 1.1375 1.0462 1.0444 3.6767 1.0528 1.0530 3.7230 5.6053 6.2697 3.0836 1.7080 3.3576 1.0363 1.0362 1.0591 1.0591 1.0970 1.0969 1.1033 1.1033 1.1055 1.1061 1.0871 1.0932 1.0923 1.1002 1.0806 1.0450 1.1047
irintensity: 0.1368 1.5412 1.2452 2.5711 0.5041 0.2763 0.2174 0.2463 0.5929 0.2138 2.4012 1.2505 2.6001 4.8765 12.6359 1.2361 3.5436 2.2218 32.9318 9.4045 17.1854 185.1124 3.9077 10.5487 2.1470 14.2252 1.6668 3.7803 111.9875 3.6792 23.1006 0.0611 0.1542 0.4461 2.8587 21.4812 26.4759 11.0369 5.8480 58.6698 0.8875 5.8482 2.7976 2.4949 15.8570 1.4445 67.3066 0.7376 5.2572 1.7229 82.7992 228.3875 77.3960 42.0822 28.5292 46.8590 28.7670 20.5181 25.1949 252.1456 357.4902 107.8985 748.7815 17.6512 7.9348 129.0064 45.6213 186.6325 6.8457 30.3854 74.6987 26.6930 24.0638 217.6104 37.2144 27.1296 22.0400 16.7895 13.3662 142.5208 9.0324 22.0278 222.9831 487.7179 193.5328 195.6168 683.2059 383.0450 28.9328 25.5705 42.3148 38.6963 44.3547 42.2394 0.8524 0.4119 31.4478 38.1834 7.3057 20.7853 3.9287 9.7960 191.5104 87.4015 36.3283
temp: 298.150 k
press: 1.00000 atm
elementType: 8 8 8 8 7 7 7 6 6 6 6 6 6 6 6 6 6 6 6 6 1 1 1 1 1 1 1 1 1 1 1 1 1 1 1 1 1
symmnumber: 1
zpe: 765738.6 jmol-1
zpe.correction: 0.291654 hartree
zpe.thermalcorrener: 0.311384 hartree
zpe.thermalcorrenthalpy: 0.312329 hartree
zpe.thermalcorrgfe: 0.241966 hartree
zpe.sumelectzpe: -969.269287 hartree
zpe.sumelectthermal: -969.249557 hartree
zpe.sumelectthermalent: -969.248613 hartree
zpe.sumelectthermalfe: -969.318975 hartree
dipole: 2.6648 0.6565 -0.1125
dipole: 2.7468
quadrupole: -74.4739 -106.5766 -120.6127
quadrupole: -7.7429 1.0288 -1.0705
quadrupole: 26.0805 -6.0222 -20.0583 -7.7429 1.0288 -1.0705
hfenergy: -969.5609417 hartree
pointgroup: C01 [X(C13H17N3O4)]
dipole: 1.0442873 0.277959 0.0073184 debye
polarizability: 335.2470229|0.2073385|206.8549172|0.4357321|7.929255|94.2030659 unknown
InChI: InChI=1S/C13H17N3O4/c1-3-19-12(17)9(13(18)20-4-2)8-15-11-7-5-6-10(14)16-11/h5-8,15H,3-4,14H2,1-2H3
charge 0 multiplicity 1
37 atoms
O  -3.40049 -1.306145 -0.03625
O  -3.217441 1.33148 0.030073
O  -1.438182 -2.555378 -0.003729
O  -1.098812 2.274114 0.034272
N  1.009743 0.74563 0.01323
N  2.901932 -0.675475 0.003494
N  4.692014 -2.166897 -0.006027
C  -1.277968 -0.135625 0.003829
C  2.417723 0.593908 0.012951
C  0.121012 -0.281645 0.002594
C  3.237255 1.749196 0.022213
C  -2.012533 -1.427535 -0.013055
C  -1.839371 1.223812 0.02485
C  4.256726 -0.854212 0.003498
C  -4.163621 -2.589514 -0.073593
C  -3.775461 2.719005 0.077053
C  4.637279 1.547731 0.02232
C  5.170982 0.246402 0.013303
C  -4.310629 -3.093617 -1.512867
C  -3.859795 3.221826 1.521358
H  0.543707 -1.290436 -0.007635
H  0.571283 1.692338 0.021773
H  2.800628 2.751656 0.028582
H  -3.645622 -3.332595 0.557875
H  -5.135934 -2.319501 0.369495
H  -3.144138 3.380184 -0.541521
H  -4.772197 2.601726 -0.377542
H  5.310761 2.41121 0.029523
H  6.251752 0.075308 0.0142
H  -3.327523 -3.36819 -1.930177
H  -4.768994 -2.320383 -2.153507
H  -4.958532 -3.990185 -1.532936
H  -2.851763 3.343598 1.951293
H  -4.434775 2.518271 2.147751
H  -4.368481 4.20381 1.546121
H  5.679937 -2.40078 -0.006498
H  3.992826 -2.906295 -0.010217
