program: Gaussian 09
title: 000296030
version: EM64L-G09RevD.01
frameworkgroup: C1[X(C11H25NO)]
method: RPBEPBE
basis: SDD
operation: Freq
keyword: #p
keyword: freq=noraman
keyword: PBEPBE/SDD
title: #p freq=noraman PBEPBE/SDD
converged: YES YES NO NO
title: Mulliken charges:
elementType: O N C C C C C C C C C C C H H H H H H H H H H H H H H H H H H H H H H H H H
charge: -0.452254 -0.107270 -0.372711 -0.376795 -0.329578 -0.331920 -0.359898 -0.365191 -0.363140 -0.366768 -0.341721 -0.685875 -0.686247 0.182454 0.200230 0.214152 0.191682 0.199015 0.177901 0.178091 0.197713 0.184587 0.183569 0.215856 0.193187 0.215709 0.193763 0.216560 0.213811 0.187020 0.186988 0.206899 0.207631 0.219095 0.206831 0.207595 0.218936 0.340094
chargesum: 0.00000
title: Mulliken charges with hydrogens summed into heavy atoms:
elementType: O N C C C C C C C C C C C
charge: -0.112159 -0.107270 0.009973 0.029040 0.047338 0.043884 0.008258 0.043851 0.046333 0.063602 0.032286 -0.052250 -0.052885
polarizability: 1.56559795e+02 1.89316521e-01 1.34179766e+02 1.23660628e+00 -1.41737387e+00 1.10270081e+02
1716.lowfreq: -5.0315 -0.0008 -0.0006 0.0000 5.2249 10.4965 31.9181 41.4762 45.1428
frequency: 31.3689 41.4636 44.8157 64.5599 73.5901 76.1746 85.2005 100.2010 119.8865 131.4736 196.8077 206.7893 218.0275 223.4952 233.5332 240.0998 277.5359 310.8508 326.2311 366.0735 417.2320 449.6037 516.4410 522.2990 738.4995 745.6933 746.0324 775.0708 813.3094 845.2734 869.5706 873.5630 896.3847 913.6541 955.7473 963.1407 990.3634 1034.7106 1038.8329 1050.8722 1060.4165 1073.1699 1076.3224 1083.2720 1108.5977 1115.2823 1139.9515 1152.9476 1194.0976 1199.9398 1208.5597 1242.3020 1244.8862 1255.1488 1260.6767 1277.0160 1287.0228 1287.1746 1290.6450 1293.2565 1307.5801 1315.9939 1318.0780 1356.3398 1366.6840 1369.4288 1378.8272 1388.3239 1390.8045 1413.4325 1463.4162 1466.4306 1467.8828 1468.8530 1473.4079 1475.9956 1477.2854 1477.4688 1479.0371 1482.1794 1487.4279 1489.2970 1490.9351 2837.4444 2838.1960 2853.9311 2924.6910 2951.0505 2971.7424 2972.0032 2972.0550 2977.9132 2985.6503 2986.0250 2992.3181 2994.4002 3012.4616 3015.0655 3018.8190 3039.5134 3041.4300 3044.8825 3060.3392 3069.8291 3070.6670 3073.7858 3074.1897 3564.3008
redmass: 4.2649 1.7955 3.4255 2.8863 1.9264 2.5199 1.6831 3.3393 1.8209 2.4646 2.2950 1.7395 2.5894 1.5021 1.3529 2.4550 1.0850 2.8920 2.7600 2.8357 3.4754 3.3700 3.0209 3.3396 1.0778 1.0973 1.0918 1.1314 2.7678 1.2618 1.3242 1.2235 1.5440 2.0484 1.2343 7.5722 3.1347 2.7918 2.9811 3.1024 2.8795 2.2234 2.0837 2.2164 1.9973 2.1882 1.6987 1.3636 1.8143 1.6494 1.5206 1.3003 1.2779 1.3574 1.3783 1.0531 1.1511 1.1355 1.1346 1.1874 1.3383 1.4222 1.3749 1.5654 1.3929 1.3835 1.4344 1.2244 1.2217 1.4407 1.0732 1.0685 1.0704 1.0744 1.0868 1.0707 1.0562 1.0445 1.0438 1.0860 1.0813 1.0837 1.0958 1.0711 1.0711 1.0706 1.0544 1.0586 1.0358 1.0982 1.0428 1.0621 1.0622 1.0619 1.0646 1.0922 1.0853 1.0875 1.0869 1.1000 1.0991 1.1023 1.1044 1.1013 1.1013 1.0990 1.0989 1.0664
irintensity: 0.1580 7.2049 0.5512 0.0029 0.0817 0.4116 0.1352 0.7117 4.4404 1.1004 0.5641 0.6234 4.6875 0.4943 0.6171 0.3874 155.8243 3.1663 1.1507 3.7262 6.9281 8.3998 2.0974 12.8933 8.8273 7.1127 7.5830 0.2327 18.3621 1.3186 2.6810 3.3640 3.7601 3.7348 3.2689 46.2881 32.4960 44.3302 11.4551 1.3450 3.2820 21.5578 18.1153 25.3856 5.3537 5.0331 0.9994 2.8311 6.8206 9.0485 22.0072 2.6349 14.9674 5.4757 14.3572 1.4848 7.3242 0.2133 2.5045 15.2935 6.3337 3.6493 3.1560 0.5365 3.9840 5.3381 2.9141 16.7468 13.2369 4.8303 0.3959 0.1522 1.2639 0.0868 0.8165 1.0642 2.2210 11.9585 13.3696 7.2773 20.5551 7.8357 10.2116 40.0095 42.7547 215.9603 61.0151 39.7389 53.8317 43.7018 44.7047 22.1479 21.8745 25.9954 34.8973 21.2225 7.1671 22.3111 21.1294 7.0087 12.3351 20.8765 118.7092 78.9914 101.5483 41.0146 64.4912 2.0990
temp: 298.150 k
press: 1.00000 atm
elementType: 8 7 6 6 6 6 6 6 6 6 6 6 6 1 1 1 1 1 1 1 1 1 1 1 1 1 1 1 1 1 1 1 1 1 1 1 1 1
symmnumber: 1
zpe: 906308.6 jmol-1
zpe.correction: 0.345195 hartree
zpe.thermalcorrener: 0.363077 hartree
zpe.thermalcorrenthalpy: 0.364021 hartree
zpe.thermalcorrgfe: 0.297390 hartree
zpe.sumelectzpe: -562.995480 hartree
zpe.sumelectthermal: -562.977598 hartree
zpe.sumelectthermalent: -562.976654 hartree
zpe.sumelectthermalfe: -563.043285 hartree
dipole: 0.0257 -1.0198 2.1771
dipole: 2.4042
quadrupole: -78.0345 -83.7860 -86.8886
quadrupole: -6.4087 8.7039 0.7397
quadrupole: 4.8685 -0.8829 -3.9856 -6.4087 8.7039 0.7397
hfenergy: -563.3406751 hartree
pointgroup: C01 [X(C11H25N1O1)]
dipole: -0.0156559 -0.4249807 -0.8448983 debye
polarizability: 156.5752196|0.6392422|134.2562579|0.0992853|0.7780183|110.1781641 unknown
InChI: InChI=1S/C11H25NO/c1-3-8-12(9-4-2)10-6-5-7-11-13/h13H,3-11H2,1-2H3
charge 0 multiplicity 1
38 atoms
O  -5.997637 0.015258 0.731112
N  1.459098 0.031489 -0.187381
C  0.160366 -0.46719 -0.710331
C  -1.048211 0.022914 0.11548
C  1.753248 1.429054 -0.597825
C  2.5872 -0.902195 -0.440302
C  -2.398122 -0.471007 -0.452388
C  2.636891 2.18591 0.417662
C  2.620025 -2.088754 0.547351
C  -3.60426 -0.005122 0.39402
C  -4.942523 -0.497067 -0.162529
C  2.962541 3.622192 -0.046795
C  3.778003 -3.066397 0.250005
H  0.015693 -0.185844 -1.785811
H  0.177081 -1.573345 -0.679748
H  -0.921348 -0.32692 1.158207
H  -1.05256 1.130781 0.156521
H  0.792726 1.970765 -0.691829
H  2.235266 1.468242 -1.609463
H  2.571446 -1.29409 -1.490689
H  3.533167 -0.337865 -0.335232
H  -2.513559 -0.109042 -1.496183
H  -2.388449 -1.580519 -0.506298
H  2.110541 2.203181 1.39062
H  3.580039 1.628416 0.583052
H  2.708036 -1.683002 1.572796
H  1.656703 -2.634566 0.509516
H  -3.499666 -0.369087 1.434369
H  -3.628399 1.10092 0.441967
H  -4.956696 -1.609202 -0.192784
H  -5.086393 -0.118382 -1.198866
H  3.507541 3.617907 -1.010115
H  2.039197 4.215929 -0.187383
H  3.590911 4.149271 0.693897
H  3.689425 -3.494368 -0.766873
H  4.75796 -2.55606 0.313751
H  3.788854 -3.905418 0.969216
H  -6.881333 -0.295289 0.409481
