program: Gaussian 09
title: 000296029
version: EM64L-G09RevD.01
frameworkgroup: C1[X(C11H15NO4)]
method: RPBEPBE
basis: SDD
operation: Freq
keyword: #p
keyword: freq=noraman
keyword: PBEPBE/SDD
title: #p freq=noraman PBEPBE/SDD
converged: YES YES NO NO
title: Mulliken charges:
elementType: O O O O N C C C C C C C C C C C H H H H H H H H H H H H H H H
charge: -0.275645 -0.435338 -0.206930 -0.216361 0.021596 -0.382144 -0.288328 -0.342157 0.264530 0.202288 -0.497737 -0.685132 -0.330260 0.395699 -0.422602 -0.388480 0.212534 0.210220 0.212037 0.213480 0.196686 0.197472 0.305362 0.212414 0.213093 0.221672 0.281712 0.251554 0.229472 0.286407 0.342889
chargesum: 0.00000
title: Mulliken charges with hydrogens summed into heavy atoms:
elementType: O O O O N C C C C C C C C C C C
charge: -0.275645 -0.092449 -0.206930 -0.216361 0.021596 0.040609 0.137189 0.052001 0.264530 0.202288 -0.192375 -0.037953 -0.048549 0.395699 0.058424 -0.102073
polarizability: 1.95349592e+02 -8.36725347e+00 1.74461133e+02 8.01662908e-01 -1.71027887e+00 8.10262996e+01
1716.lowfreq: -13.1462 -4.0668 -0.0006 0.0005 0.0009 5.0620 27.5441 40.7285 51.6935
frequency: 26.2270 40.3241 51.6898 55.7042 70.1571 99.3431 113.6236 145.9673 150.5301 164.8162 209.7535 225.2058 239.5290 267.6834 294.8770 336.9159 358.3177 364.5206 432.2607 450.2780 495.4508 549.3689 553.0486 606.6180 629.9557 702.4810 712.4940 742.2006 747.6765 772.7524 813.1596 847.8640 883.4001 896.1230 912.0788 939.4797 949.2673 972.5181 984.2801 995.6263 1040.3034 1079.6265 1084.4950 1113.4651 1124.5903 1145.2825 1161.9807 1178.1448 1212.3877 1213.9325 1230.7300 1258.4563 1271.6462 1282.1080 1284.6764 1313.5573 1344.0256 1349.4655 1365.6832 1380.8555 1393.2928 1405.5799 1427.6970 1451.1047 1469.0426 1471.7424 1477.3715 1477.5657 1485.8123 1492.5892 1590.3568 1609.1360 2957.1540 2969.0738 2977.7476 2983.7511 2993.5660 3012.0321 3017.8196 3056.1377 3060.0570 3076.2180 3079.2148 3158.1550 3189.8168 3191.6781 3558.2154
redmass: 3.4705 1.7452 4.7431 7.5563 4.7009 2.9573 2.7882 6.0812 2.1549 4.0885 4.9260 1.1258 5.6576 4.1755 3.5859 4.9611 1.5356 3.1125 3.9902 3.2208 7.5315 6.3496 6.1652 4.6636 6.8970 7.0640 2.9217 1.0781 10.7269 4.8591 1.1381 1.2999 4.2333 1.5333 2.1285 1.1555 1.7234 5.9952 2.2354 2.0126 3.2926 2.1243 2.2754 1.7507 2.6328 1.4594 1.1667 2.0657 7.5824 1.3641 4.5514 1.4130 1.3183 1.1761 1.0626 1.3312 1.4424 1.3967 6.1799 1.4618 1.2266 5.2423 3.9808 1.1613 1.1230 1.1433 1.1496 1.1981 1.2812 1.2459 7.9901 7.2538 1.0555 1.0590 1.0364 1.0641 1.0590 1.1005 1.1066 1.0973 1.1049 1.1016 1.0994 1.0898 1.0931 1.0933 1.0663
irintensity: 0.2700 0.1128 0.4627 2.0443 3.5613 1.0470 0.8906 4.2931 5.8851 0.5602 3.2944 0.2463 0.0232 4.3470 26.5777 3.6662 144.8620 18.4790 2.0464 4.3558 1.9448 1.7394 0.4303 12.2858 1.0195 15.8672 8.5907 9.1292 36.7048 0.8972 0.0066 21.0547 1.5464 42.0781 11.2001 0.1752 80.5211 97.9523 33.4457 14.5952 23.3165 7.8506 26.8711 10.7190 5.6880 2.3276 20.0603 60.4936 252.5657 0.2020 270.8334 10.7420 5.0478 0.2291 0.1785 23.8886 4.5546 25.4599 46.8342 56.4112 4.6720 102.3344 50.8913 46.7405 7.9504 5.2823 27.1113 32.2483 18.7804 8.8813 6.9694 49.9205 16.1261 31.9641 32.5717 20.0837 38.4896 15.1455 4.4433 7.9642 20.8713 99.2542 45.0650 1.8742 0.6235 5.1979 11.6421
temp: 298.150 k
press: 1.00000 atm
elementType: 8 8 8 8 7 6 6 6 6 6 6 6 6 6 6 6 1 1 1 1 1 1 1 1 1 1 1 1 1 1 1
symmnumber: 1
zpe: 647603.8 jmol-1
zpe.correction: 0.246659 hartree
zpe.thermalcorrener: 0.263425 hartree
zpe.thermalcorrenthalpy: 0.264370 hartree
zpe.thermalcorrgfe: 0.200042 hartree
zpe.sumelectzpe: -782.498861 hartree
zpe.sumelectthermal: -782.482095 hartree
zpe.sumelectthermalent: -782.481150 hartree
zpe.sumelectthermalfe: -782.545478 hartree
dipole: -4.6822 2.1510 1.1180
dipole: 5.2725
quadrupole: -97.6005 -113.1744 -92.2101
quadrupole: 15.8116 1.6868 5.7130
quadrupole: 3.3945 -12.1794 8.7849 15.8116 1.6868 5.7130
hfenergy: -782.7455201 hartree
pointgroup: C01 [X(C11H15N1O4)]
dipole: 1.975454 -0.5188986 0.3624332 debye
polarizability: 197.5558209|-3.7510482|171.5443993|-3.9719971|7.5559826|81.7368042 unknown
InChI: InChI=1S/C11H15NO4/c1-2-3-6-16-11-7-10(12(14)15)5-4-9(11)8-13/h4-5,7,13H,2-3,6,8H2,1H3
charge 0 multiplicity 1
31 atoms
O  1.487998 -0.439635 -0.030581
O  -0.145736 -4.31954 -0.025143
O  -4.328974 1.329077 0.284339
O  -2.513772 2.705145 0.390436
N  -3.054173 1.535225 0.277953
C  3.626044 0.698712 0.041141
C  2.111351 0.899032 0.095084
C  4.390198 2.041221 0.128808
C  0.092602 -0.523111 -0.0041
C  -0.439328 -1.844393 -0.127213
C  -0.762541 0.590241 0.132118
C  5.920639 1.84736 0.078105
C  -1.839718 -2.017499 -0.12604
C  -2.156781 0.36421 0.134065
C  0.507705 -3.028733 -0.260673
C  -2.71842 -0.920971 0.004689
H  3.886728 0.178858 -0.900694
H  3.933812 0.035265 0.872079
H  1.799268 1.358634 1.055535
H  1.7616 1.541468 -0.739027
H  4.1152 2.565276 1.066725
H  4.074218 2.702203 -0.703696
H  -0.398196 1.614321 0.234119
H  6.269587 1.217157 0.9173
H  6.227364 1.354202 -0.863152
H  6.449088 2.815699 0.140096
H  -2.231793 -3.032593 -0.241648
H  0.891836 -3.095672 -1.293882
H  1.384338 -2.882525 0.401885
H  -3.804009 -1.042054 0.003687
H  -0.404435 -4.382281 0.929383
