program: Gaussian 09
title: 000296028
version: EM64L-G09RevD.01
frameworkgroup: C1[X(C11H14ClNO)]
method: RPBEPBE
basis: SDD
operation: Freq
keyword: #p
keyword: freq=noraman
keyword: PBEPBE/SDD
title: #p freq=noraman PBEPBE/SDD
converged: YES YES NO NO
title: Mulliken charges:
elementType: Cl O N C C C C C C C C C C C H H H H H H H H H H H H H H
charge: -0.046969 -0.259733 -0.229980 0.263682 -0.346428 0.355192 -0.349714 0.239035 -0.674915 -0.384000 -0.810703 -0.236041 -0.233294 -0.710274 0.214048 0.255157 0.255549 0.250947 0.221094 0.220504 0.236563 0.256363 0.227598 0.226732 0.233562 0.231262 0.296621 0.298143
chargesum: 0.00000
title: Mulliken charges with hydrogens summed into heavy atoms:
elementType: Cl O N C C C C C C C C C C C
charge: -0.046969 -0.259733 -0.229980 0.263682 0.122777 0.355192 -0.094165 0.239035 0.017630 -0.147437 -0.100010 -0.002479 -0.002032 -0.115510
polarizability: 1.56985626e+02 1.22133967e+01 1.18121798e+02 3.81711644e+00 -1.19703687e+01 1.24656489e+02
1716.lowfreq: -11.7507 -9.2787 0.0009 0.0016 0.0021 3.9800 28.9968 54.1060 62.7135
frequency: 28.1948 53.9739 62.5055 73.1383 86.8269 106.1799 115.7228 180.2928 196.1239 220.3976 249.9975 277.2321 339.1330 363.5979 394.0280 425.7269 469.1539 498.3511 533.9914 567.1260 572.4278 634.9371 682.3647 731.5895 743.4952 767.9676 777.7393 793.3176 873.7767 893.9731 933.2347 942.6431 953.9218 986.0478 990.7651 1041.4601 1047.4098 1057.4359 1090.3416 1104.6920 1128.3994 1155.1598 1173.6607 1205.5728 1254.6562 1257.1247 1279.8748 1292.7594 1353.3022 1365.5950 1380.1809 1386.8355 1401.1258 1430.5129 1434.5919 1448.7556 1467.2973 1471.3832 1475.2454 1483.8496 1485.3481 1576.8557 1588.5582 1609.0856 2978.3648 2987.6036 3019.3548 3061.1351 3075.7068 3081.7829 3086.2930 3095.9313 3106.5738 3124.4243 3130.4811 3145.2878 3165.0881 3175.4348
redmass: 7.4651 3.9484 2.8652 6.0868 2.2943 1.8953 2.2588 7.7166 2.9011 1.2903 2.6960 2.3667 2.6128 3.1872 5.1316 2.8574 2.9317 4.5784 5.9591 3.7096 5.6361 5.7843 4.3360 2.4692 6.9031 1.3934 1.5727 2.7259 1.2970 2.0498 2.6887 2.0539 1.4944 1.6025 1.3255 2.1889 1.6035 2.7003 1.8969 1.6240 1.4713 1.6080 1.0626 2.4443 2.0519 1.1936 1.4847 2.0087 1.3535 4.4543 2.6187 1.3391 1.2371 1.5259 1.3625 1.1086 1.1333 1.0453 1.1817 1.3146 1.5865 7.0041 6.9354 6.3607 1.0399 1.0354 1.0593 1.0932 1.1015 1.0567 1.1003 1.1000 1.1032 1.0859 1.0895 1.0942 1.1009 1.1112
irintensity: 1.4633 1.8505 0.1239 0.9352 2.0942 0.2004 0.8926 2.0609 0.2596 2.1448 0.6793 9.9719 0.1316 7.4578 5.1569 1.1016 7.8662 3.7502 11.0754 15.8900 7.0949 20.9946 7.3518 15.2102 0.9618 62.3484 6.8463 3.1706 0.2180 1.8178 1.4702 3.1546 0.1682 1.4331 0.0452 5.3819 16.2151 5.8209 12.6078 41.6661 20.1241 3.5507 0.5143 2.3947 17.2379 6.1173 0.2206 82.8117 2.0070 9.7549 53.1371 26.2987 18.9414 6.2518 27.9491 19.4493 6.6216 16.2186 15.9416 49.7657 24.6274 248.3294 59.6931 6.5222 23.8232 24.2130 22.7409 13.5571 9.6332 8.6477 29.8638 12.6780 26.0014 5.3465 4.5693 24.7503 21.9592 3.3671
temp: 298.150 k
press: 1.00000 atm
elementType: 17 8 7 6 6 6 6 6 6 6 6 6 6 6 1 1 1 1 1 1 1 1 1 1 1 1 1 1
symmnumber: 1
zpe: 593350.3 jmol-1
zpe.correction: 0.225995 hartree
zpe.thermalcorrener: 0.240701 hartree
zpe.thermalcorrenthalpy: 0.241646 hartree
zpe.thermalcorrgfe: 0.182782 hartree
zpe.sumelectzpe: -1016.567017 hartree
zpe.sumelectthermal: -1016.552311 hartree
zpe.sumelectthermalent: -1016.551366 hartree
zpe.sumelectthermalfe: -1016.610230 hartree
dipole: -4.1156 1.4103 -0.3153
dipole: 4.3619
quadrupole: -98.0372 -92.9760 -80.9660
quadrupole: 1.7795 -0.2301 0.5762
quadrupole: -7.3775 -2.3163 9.6937 1.7795 -0.2301 0.5762
hfenergy: -1016.7930121 hartree
pointgroup: C01 [X(C11H14Cl1N1O1)]
dipole: -1.6255804 0.4993557 -0.2306381 debye
polarizability: 156.6479468|13.2821708|114.1481901|1.52549|-9.7974058|128.9677763 unknown
InChI: InChI=1S/C11H14ClNO/c1-3-13(11(14)8-12)10-7-5-4-6-9(10)2/h4-7H,3,8H2,1-2H3
charge 0 multiplicity 1
28 atoms
Cl 1.524372 -2.754588 0.611302
O  3.076373 0.363823 -0.303459
N  0.794988 0.594434 0.111996
C  -0.579699 0.161334 -0.053804
C  1.033862 1.962981 0.655074
C  -1.335765 -0.276194 1.072926
C  -1.167701 0.223537 -1.341714
C  1.902326 -0.123261 -0.332804
C  1.07504 3.03704 -0.450705
C  -2.685547 -0.653112 0.85442
C  -0.725624 -0.349472 2.458949
C  -2.510781 -0.163351 -1.536062
C  -3.272686 -0.602003 -0.429383
C  1.674729 -1.545185 -0.842635
H  0.227922 2.181203 1.377407
H  1.998424 1.941381 1.190822
H  -0.56366 0.583919 -2.182662
H  1.905192 2.834114 -1.148017
H  0.126518 3.066957 -1.016479
H  1.237763 4.034034 -0.001811
H  -3.279283 -1.001507 1.707786
H  0.289252 -0.781779 2.423159
H  -0.640544 0.653478 2.920613
H  -1.344568 -0.970093 3.128538
H  -2.957023 -0.116371 -2.535156
H  -4.316735 -0.904811 -0.565184
H  0.753386 -1.681886 -1.423494
H  2.566369 -1.867422 -1.394222
