program: Gaussian 09
title: 000296024
version: EM64L-G09RevD.01
frameworkgroup: C1[X(C11H22O3)]
method: RPBEPBE
basis: SDD
operation: Freq
keyword: #pfreq=noraman
keyword: PBEPBE/SDD
title: #p freq=noraman PBEPBE/SDD
converged: YES YES NO NO
title: Mulliken charges:
elementType: O O O C C C C C C C C C C C H H H H H H H H H H H H H H H H H H H H H H
charge: -0.487730 -0.256936 -0.265465 0.253922 -0.436825 -0.408994 -0.032318 -0.391322 0.129578 -0.718288 -0.715118 -0.720376 -0.261946 -0.663029 0.225727 0.221830 0.231892 0.196090 0.197711 0.218535 0.211778 0.207789 0.211487 0.214990 0.209130 0.219744 0.209183 0.215656 0.244345 0.215133 0.362156 0.225795 0.237602 0.220918 0.249192 0.228161
chargesum: 0.00000
title: Mulliken charges with hydrogens summed into heavy atoms:
elementType: O O O C C C C C C C C C C C
charge: -0.125573 -0.256936 -0.265465 0.253922 0.010732 0.018988 0.165393 0.038992 0.129578 -0.084022 -0.077061 -0.045242 0.201451 0.035242
polarizability: 1.35798187e+02 -2.22881693e+00 1.34676451e+02 -4.14858352e-01 -1.91768398e+00 1.14891034e+02
1716.lowfreq: -11.6444 -5.3401 -0.0008 -0.0005 -0.0004 10.6424 19.6770 36.7307 43.2259
frequency: 19.3283 36.5500 43.1936 68.2162 79.4923 97.7892 101.8195 121.2449 160.0425 170.8730 193.8073 215.1639 226.6133 233.3453 238.1271 266.1681 307.8763 338.5553 354.0303 365.1706 369.7265 398.3726 407.8244 481.3725 486.0344 533.2398 602.1070 718.0456 747.1723 763.0449 777.6776 790.1017 817.0394 822.5702 899.4463 915.3752 932.0535 954.9525 968.3771 986.2968 994.3914 1010.6177 1048.0585 1077.6904 1092.9774 1095.2750 1116.3018 1135.0347 1137.3906 1158.9668 1185.2018 1193.0862 1223.2113 1266.6030 1271.5209 1277.6870 1299.5585 1317.2801 1324.0813 1337.7018 1351.0440 1360.2061 1373.5093 1376.3164 1388.4016 1391.0856 1391.3684 1440.6268 1454.2131 1458.8518 1462.7054 1464.5685 1468.3494 1476.2194 1476.6961 1482.2785 1484.6836 1485.6540 1489.5513 1600.9413 2949.2841 2965.1191 2967.9178 2973.6049 2980.9722 2993.1959 2995.8315 3002.0096 3026.5143 3032.1235 3052.5014 3060.8565 3061.5925 3068.4133 3069.1968 3071.0987 3074.8810 3088.4167 3094.3520 3094.5189 3121.1824 3460.2252
redmass: 2.8780 3.3058 3.1183 2.7017 4.1721 2.4897 3.2189 2.4002 2.0262 2.2778 1.9827 1.1404 1.4871 1.4613 1.1908 2.2915 2.6612 3.3317 3.8131 2.2033 2.5724 1.1492 3.0136 3.7190 2.8580 3.1169 3.3326 3.6757 2.8078 1.3297 1.5736 2.5582 1.5110 3.1034 1.6356 1.4360 2.3586 1.4184 1.7995 2.2646 1.9007 2.5052 2.3463 2.1601 1.5911 2.1816 2.7070 2.8237 2.1365 1.6864 2.6030 1.9300 1.3670 1.4493 1.2018 1.1249 1.2367 1.5214 1.4468 1.4321 1.2619 1.4252 1.2762 1.3778 1.2466 1.2254 1.2250 1.0819 1.0870 1.1048 1.0473 1.0454 1.0852 1.0555 1.0437 1.0532 1.0535 1.0524 1.0552 8.6898 1.0723 1.0633 1.0417 1.0395 1.0369 1.0359 1.0594 1.0589 1.0957 1.0597 1.1007 1.0999 1.0998 1.1014 1.0987 1.0993 1.1000 1.0975 1.1027 1.1002 1.1068 1.0651
irintensity: 0.5100 0.2852 0.8995 0.0462 1.2795 0.0585 2.1672 0.2199 0.2297 0.4317 1.3723 0.1076 5.4763 1.5167 2.7084 18.1885 2.9832 17.5294 27.5250 0.1662 1.8583 86.8268 2.5052 1.5920 0.4647 8.9743 20.1415 7.1600 4.1951 3.6715 4.3602 1.7625 5.5329 3.5258 11.8887 0.6698 16.8610 3.4237 21.8957 7.0464 4.7670 61.4126 7.7811 49.1382 2.2873 30.1445 27.4743 133.6823 56.3888 8.0232 123.9844 6.3349 11.1387 26.6963 7.4275 4.8398 10.2525 1.5275 11.0692 4.2694 2.3495 4.0512 10.7293 14.8332 19.6171 18.0854 21.7861 0.4863 5.2944 21.6586 10.3749 5.9417 2.1965 0.6371 9.3146 15.2991 17.5978 8.9906 20.6327 129.9348 19.6048 48.5071 52.5622 9.5276 31.4683 14.9770 2.6701 40.8118 11.5580 28.5657 2.4738 34.7653 17.9189 8.1698 114.0405 52.3995 68.7346 36.2805 1.7882 30.0585 27.3341 41.9083
temp: 298.150 k
press: 1.00000 atm
elementType: 8 8 8 6 6 6 6 6 6 6 6 6 6 6 1 1 1 1 1 1 1 1 1 1 1 1 1 1 1 1 1 1 1 1 1 1
symmnumber: 1
zpe: 823341.5 jmol-1
zpe.correction: 0.313594 hartree
zpe.thermalcorrener: 0.331793 hartree
zpe.thermalcorrenthalpy: 0.332737 hartree
zpe.thermalcorrgfe: 0.266361 hartree
zpe.sumelectzpe: -656.884121 hartree
zpe.sumelectthermal: -656.865922 hartree
zpe.sumelectthermalent: -656.864978 hartree
zpe.sumelectthermalfe: -656.931354 hartree
dipole: -0.4141 2.6965 -1.7775
dipole: 3.2561
quadrupole: -84.8579 -85.0756 -90.4084
quadrupole: -3.4160 3.5018 1.6883
quadrupole: 1.9227 1.7050 -3.6278 -3.4160 3.5018 1.6883
hfenergy: -657.197715 hartree
pointgroup: C01 [X(C11H22O3)]
dipole: -0.3653705 1.065343 -0.6104423 debye
polarizability: 136.2839848|-2.0023743|134.2085074|-1.8120997|-0.6310391|114.8731802 unknown
InChI: InChI=1S/C11H22O3/c1-5-11(13,8-7-9(3)4)10(12)14-6-2/h9,13H,5-8H2,1-4H3
charge 0 multiplicity 1
36 atoms
O  -0.109298 -2.079428 1.011713
O  -1.730609 0.800367 -0.589305
O  -1.771372 -0.032312 1.587399
C  -0.407202 -1.186053 -0.116373
C  0.921028 -0.548542 -0.618808
C  1.652115 0.27895 0.459548
C  3.034837 0.848866 0.030837
C  -1.083155 -2.019516 -1.241931
C  -1.365688 -0.093102 0.397085
C  2.923134 1.847863 -1.146989
C  4.060619 -0.267005 -0.284911
C  -2.4116 -2.675869 -0.818861
C  -2.635811 1.927588 -0.185786
C  -1.823174 3.094063 0.380368
H  1.560404 -1.389947 -0.945504
H  0.695024 0.07028 -1.506647
H  1.786785 -0.362942 1.351654
H  1.00956 1.130601 0.769381
H  3.420432 1.412393 0.90752
H  -0.356546 -2.804433 -1.525861
H  -1.233637 -1.367349 -2.122436
H  2.186224 2.644748 -0.929775
H  3.897698 2.331167 -1.347259
H  2.60862 1.339657 -2.077668
H  5.066928 0.160801 -0.451242
H  4.129304 -0.992534 0.546808
H  3.783696 -0.825357 -1.198782
H  -3.186207 -1.921548 -0.583752
H  -2.25914 -3.306446 0.073907
H  -2.805005 -3.314821 -1.629655
H  -0.596591 -1.732986 1.809823
H  -3.14631 2.191205 -1.125375
H  -3.36192 1.543445 0.551832
H  -2.494758 3.94865 0.583568
H  -1.333954 2.809316 1.326813
H  -1.053426 3.42443 -0.338437
