program: Gaussian 09
title: 000296033
version: EM64L-G09RevD.01
frameworkgroup: C1[X(C11H19NO4)]
method: RPBEPBE
basis: SDD
operation: Freq
keyword: #p
keyword: freq=noraman
keyword: PBEPBE/SDD
title: #p freq=noraman PBEPBE/SDD
converged: YES YES NO NO
title: Mulliken charges:
elementType: O O O O N C C C C C C C C C C C H H H H H H H H H H H H H H H H H H H
charge: -0.272328 -0.237424 -0.271467 -0.236843 -0.062612 -0.183105 -0.432516 -0.418216 -0.383913 -0.404388 -0.440999 0.202361 0.247388 -0.505773 -0.259518 -0.663423 0.254205 0.222500 0.224473 0.211889 0.214664 0.179131 0.252087 0.208098 0.224925 0.251072 0.216866 0.240810 0.239500 0.232807 0.234179 0.223374 0.217396 0.226947 0.247853
chargesum: 0.00000
title: Mulliken charges with hydrogens summed into heavy atoms:
elementType: O O O O N C C C C C C C C C C C
charge: -0.272328 -0.237424 -0.271467 -0.236843 -0.062612 0.071100 0.014456 0.008337 0.047305 0.028635 0.026939 0.202361 0.247388 0.207344 0.198034 0.028773
polarizability: 1.66291099e+02 -2.74002135e+00 1.23545805e+02 -1.77174233e+00 4.89306752e+00 1.18670079e+02
1716.lowfreq: -22.0999 -10.6703 -10.0017 -0.0006 0.0004 0.0005 10.9519 15.9109 27.5725
frequency: 10.0508 13.2734 27.4442 53.9634 64.6923 85.2098 92.1344 104.4091 142.6296 167.7235 187.5113 225.1918 232.1401 263.8344 294.4753 310.4883 318.1478 332.4114 369.2202 396.5551 417.6431 462.7603 520.9988 550.0405 566.3384 614.0889 661.6640 734.8779 756.4072 793.1125 810.1231 815.4922 824.7162 860.3896 888.7138 914.5737 951.2182 981.0820 998.1158 1015.1541 1017.5369 1056.2362 1086.1218 1088.1389 1094.4776 1111.8739 1112.8842 1126.6224 1145.1130 1147.8061 1156.3700 1158.3486 1192.2310 1197.5882 1231.1303 1260.3205 1278.5149 1289.7320 1299.6502 1324.2810 1339.8398 1342.6959 1353.9126 1360.6220 1369.2464 1388.7782 1390.7917 1421.2215 1438.2305 1445.1666 1451.7025 1458.0953 1458.3268 1463.5481 1464.4956 1470.5210 1482.5591 1484.4758 1631.7160 1655.4459 2817.9555 2832.0680 2885.9482 2986.5037 2992.2818 3003.0938 3004.8901 3015.4276 3025.8383 3028.9162 3036.3868 3069.4070 3069.8765 3080.9564 3087.3451 3091.9453 3103.6954 3118.1967 3146.9327
redmass: 4.6409 4.3098 3.6064 3.3655 5.2107 1.6631 1.8500 3.6386 3.2990 3.2230 2.1480 1.9560 1.9735 3.5457 2.4236 2.4668 3.4109 3.8637 2.2953 2.8374 3.2037 3.6405 4.4670 3.1197 2.7530 3.5511 4.4061 4.7940 3.4860 1.5187 1.5280 3.5700 2.5410 3.4996 3.1876 2.5829 4.1931 2.0869 2.3924 1.5461 2.9575 2.3246 1.7891 2.2283 2.1279 1.4198 2.5059 3.4460 2.0530 1.4942 1.6665 2.3923 1.1455 1.4431 1.2923 1.6392 1.1179 1.3615 1.3424 1.6521 1.5211 1.3749 1.2924 1.4088 1.4619 1.2494 1.4298 1.1793 1.0992 1.0910 1.0505 1.0898 1.0882 1.0454 1.0514 1.0782 1.0993 1.0518 9.4430 9.1982 1.0719 1.0700 1.0691 1.0779 1.0360 1.0297 1.0653 1.0657 1.0851 1.0596 1.0844 1.1023 1.0882 1.1022 1.0974 1.1031 1.1044 1.1060 1.1047
irintensity: 1.2203 0.4391 0.0451 1.1289 1.1349 0.8202 0.5148 3.2297 3.0122 4.3755 4.1879 2.5628 5.2276 4.6492 4.1612 14.0104 17.1068 9.2814 2.4888 1.7668 1.6977 1.3892 0.9739 5.1060 2.3003 3.5658 8.3865 7.4623 5.1401 10.3153 0.4332 12.6761 2.2908 9.9524 3.0649 3.0701 1.2075 5.0135 39.3121 18.9654 102.9437 34.1557 28.1048 45.1327 85.0876 73.9124 374.9196 158.8813 37.4603 2.9386 10.1964 29.5375 0.6266 20.6743 3.1925 2.8083 3.2154 17.9372 12.4576 16.2959 3.3768 1.4528 0.8186 5.1867 1.5006 25.3249 7.8193 13.3708 21.1640 10.5734 13.1478 12.2630 13.7505 13.4692 12.8821 2.0938 15.7695 12.4376 137.8876 156.3828 73.4618 102.6070 67.2499 14.3663 19.5657 35.4369 20.6543 42.1053 50.5464 37.5032 14.7958 28.3711 5.7546 24.5226 37.6399 0.9336 27.9355 34.4841 16.4806
temp: 298.150 k
press: 1.00000 atm
elementType: 8 8 8 8 7 6 6 6 6 6 6 6 6 6 6 6 1 1 1 1 1 1 1 1 1 1 1 1 1 1 1 1 1 1 1
symmnumber: 1
zpe: 768439.5 jmol-1
zpe.correction: 0.292683 hartree
zpe.thermalcorrener: 0.310479 hartree
zpe.thermalcorrenthalpy: 0.311423 hartree
zpe.thermalcorrgfe: 0.242759 hartree
zpe.sumelectzpe: -784.930745 hartree
zpe.sumelectthermal: -784.912950 hartree
zpe.sumelectthermalent: -784.912006 hartree
zpe.sumelectthermalfe: -784.980669 hartree
dipole: 0.3901 1.2187 -0.6802
dipole: 1.4492
quadrupole: -77.6955 -90.3730 -102.5872
quadrupole: -4.1378 -6.5745 -3.7324
quadrupole: 12.5231 -0.1544 -12.3686 -4.1378 -6.5745 -3.7324
hfenergy: -785.2234284 hartree
pointgroup: C01 [X(C11H19N1O4)]
dipole: 0.1611839 -0.5255513 0.1513224 debye
polarizability: 166.0795552|3.0503009|121.1654687|3.1142704|5.5723755|121.2619595 unknown
InChI: InChI=1S/C11H19NO4/c1-3-16-10(13)8-12-6-4-9(5-7-12)11(14)15-2/h9H,3-8H2,1-2H3
charge 0 multiplicity 1
35 atoms
O  -3.860182 -1.264744 -0.603874
O  -3.500572 -0.13139 1.392524
O  3.920947 0.165184 0.884394
O  2.847731 0.001814 -1.182715
N  0.348679 0.761943 0.131192
C  -2.483263 0.711646 -0.726098
C  -1.354484 -0.036624 -1.49497
C  -1.881833 1.880752 0.089273
C  -0.194285 -0.433384 -0.563962
C  -0.691798 1.42953 0.959798
C  1.561679 0.480129 0.908333
C  -3.298887 -0.232112 0.15962
C  2.795222 0.194133 0.050897
C  -4.702437 -2.230117 0.142019
C  5.22941 -0.147264 0.230035
C  5.442917 -1.660674 0.137321
H  -3.198058 1.107353 -1.47563
H  -0.957303 0.643322 -2.271017
H  -1.764155 -0.931416 -1.994732
H  -2.652142 2.333816 0.739187
H  -1.5287 2.651412 -0.621089
H  -0.544226 -1.202602 0.176585
H  0.613762 -0.882456 -1.164256
H  -0.23698 2.316257 1.440213
H  -1.066679 0.760065 1.772499
H  1.803115 1.35493 1.539669
H  1.450732 -0.383581 1.616459
H  -5.550812 -1.70994 0.617928
H  -4.107807 -2.735146 0.921937
H  -5.049849 -2.944886 -0.617089
H  5.242079 0.322297 -0.769353
H  5.969326 0.336455 0.887526
H  6.447995 -1.87135 -0.27329
H  5.3719 -2.130922 1.133358
H  4.695859 -2.120932 -0.530894
