program: Gaussian 09
title: 000296021
version: EM64L-G09RevD.01
frameworkgroup: C1[X(C10H15NO)]
method: RPBEPBE
basis: SDD
operation: Freq
keyword: #p
keyword: freq=noraman
keyword: PBEPBE/SDD
title: #p freq=noraman PBEPBE/SDD
converged: YES YES NO NO
title: Mulliken charges:
elementType: O N C C C C C C C C C C H H H H H H H H H H H H H H H
charge: -0.295126 -0.328022 -0.056910 -0.320105 -0.698967 0.378030 -0.637933 -0.345567 -0.385960 -0.223746 -0.197658 -0.257225 0.197234 0.219552 0.200974 0.226965 0.225361 0.203609 0.284808 0.221186 0.225418 0.190483 0.249310 0.247327 0.222903 0.226582 0.227478
chargesum: 0.00000
title: Mulliken charges with hydrogens summed into heavy atoms:
elementType: O N C C C C C C C C C C
charge: -0.295126 -0.043215 0.140324 0.100421 -0.043032 0.378030 -0.000846 -0.096257 -0.138633 -0.000843 0.028924 -0.029747
polarizability: 1.63316686e+02 -2.51104468e+00 1.17340552e+02 -5.20823958e+00 -6.91309713e+00 7.23581858e+01
1716.lowfreq: -8.2443 -3.7694 -0.0004 0.0002 0.0004 3.9219 40.4221 47.7006 80.5308
frequency: 40.4076 47.6573 80.4909 119.6507 138.4882 192.9911 213.8159 227.3111 241.3274 283.0455 295.7591 411.6573 435.3619 466.9699 501.9340 503.1859 588.2887 610.7660 690.7859 700.9694 757.4681 789.3301 821.2325 830.8578 887.9813 915.9550 948.5253 960.9022 976.3117 981.3946 986.2931 1022.1003 1048.4874 1081.0646 1083.8594 1099.2291 1136.7181 1166.8338 1175.8196 1178.3149 1193.1438 1217.4096 1237.5721 1300.0020 1313.0243 1345.5090 1367.0561 1382.7073 1390.8099 1437.8934 1443.1620 1454.1820 1459.8270 1462.7145 1479.9296 1480.9230 1486.1109 1495.9661 1591.9995 1612.0682 2849.9660 2870.2289 2962.9176 2984.7135 3020.6224 3033.7880 3077.0043 3080.6073 3092.2804 3127.5585 3136.0193 3154.6546 3162.5000 3172.0177 3450.0876
redmass: 4.3174 3.4479 2.8499 2.3364 3.4290 1.0277 1.8172 2.5255 3.3286 2.0901 3.3699 2.9184 2.7029 3.3311 2.7959 2.8272 5.3421 6.4057 1.9895 1.6220 1.6472 5.1395 1.2974 1.8701 1.4522 1.5253 1.5373 1.3624 4.7201 1.2993 6.1336 2.0506 1.7150 1.6313 1.7383 1.6772 1.8456 1.0948 1.2234 1.4948 2.5222 3.1824 1.2886 1.3332 1.3357 1.3709 1.5791 1.3694 3.6583 1.1637 2.2846 1.1375 1.1485 1.0819 1.4182 1.4537 1.0692 1.0532 6.4686 6.2503 1.0809 1.0568 1.0547 1.0361 1.0746 1.1081 1.0993 1.0992 1.0995 1.0847 1.0889 1.0924 1.0954 1.1008 1.0742
irintensity: 0.6366 0.1149 1.7883 2.3493 3.3352 0.2626 0.8344 2.9658 0.4152 1.4778 1.3933 0.0289 11.2318 6.7978 2.5625 11.1293 7.5416 0.4097 14.1477 107.1623 99.9990 15.4958 1.7714 14.7470 8.5890 2.7679 0.6501 0.0463 58.9407 0.5931 30.1187 20.8283 6.4495 23.0159 7.2196 0.6282 5.7167 16.1441 52.8740 6.8401 21.2166 220.3580 1.9640 0.9443 0.4480 32.4434 3.9085 13.5566 21.8263 2.8219 3.6766 19.8968 70.0747 47.1653 39.5289 28.2089 5.3836 23.3377 24.3370 78.8092 70.6949 154.9722 29.2244 30.2459 58.7647 32.7759 44.9995 31.0957 37.2450 3.0901 11.7515 31.0553 23.4553 6.3774 4.7179
temp: 298.150 k
press: 1.00000 atm
elementType: 8 7 6 6 6 6 6 6 6 6 6 6 1 1 1 1 1 1 1 1 1 1 1 1 1 1 1
symmnumber: 1
zpe: 603913.9 jmol-1
zpe.correction: 0.230019 hartree
zpe.thermalcorrener: 0.242504 hartree
zpe.thermalcorrenthalpy: 0.243448 hartree
zpe.thermalcorrgfe: 0.190603 hartree
zpe.sumelectzpe: -519.089454 hartree
zpe.sumelectthermal: -519.076969 hartree
zpe.sumelectthermalent: -519.076024 hartree
zpe.sumelectthermalfe: -519.128870 hartree
dipole: -0.3984 0.6927 0.5681
dipole: 0.9805
quadrupole: -66.6862 -65.8480 -78.3687
quadrupole: 0.1455 -3.2917 -0.9712
quadrupole: 3.6147 4.4530 -8.0677 0.1455 -3.2917 -0.9712
hfenergy: -519.3194729 hartree
pointgroup: C01 [X(C10H15N1O1)]
dipole: -0.1291401 -0.1647183 0.3240193 debye
polarizability: 161.7977212|10.4606704|78.5992764|-7.3962575|15.3586611|112.6184263 unknown
InChI: InChI=1S/C10H15NO/c1-9(11-2)8-12-10-6-4-3-5-7-10/h3-7,9,11H,8H2,1-2H3
charge 0 multiplicity 1
27 atoms
O  -0.295381 -0.389968 -0.36825
N  -3.005736 0.270056 -0.806585
C  -2.579243 -0.421123 0.431597
C  -1.149656 0.024178 0.762407
C  -3.509756 -0.084232 1.616697
C  1.073402 -0.07466 -0.311691
C  -4.279701 -0.189683 -1.390099
C  1.689509 0.614143 0.762971
C  1.842146 -0.499903 -1.423806
C  3.079513 0.872221 0.711158
C  3.225248 -0.234771 -1.459463
C  3.85434 0.453308 -0.39233
H  -2.563755 -1.534181 0.299717
H  -1.11516 1.127079 0.871735
H  -0.796074 -0.460717 1.694556
H  -4.537256 -0.438804 1.426752
H  -3.548556 1.009103 1.771632
H  -3.157022 -0.569608 2.545775
H  -2.240379 0.243199 -1.4942
H  -4.420663 0.290217 -2.374608
H  -5.131195 0.113829 -0.754754
H  -4.342251 -1.29727 -1.533146
H  1.109575 0.949998 1.627463
H  1.340584 -1.031967 -2.238289
H  3.55401 1.40563 1.542753
H  3.81395 -0.56631 -2.322159
H  4.929507 0.658033 -0.423138
