program: Gaussian 09
title: 000296020
version: EM64L-G09RevD.01
frameworkgroup: C1[X(C10H15NO)]
method: RPBEPBE
basis: SDD
operation: Freq
keyword: #p
keyword: freq=noraman
keyword: PBEPBE/SDD
title: #p freq=noraman PBEPBE/SDD
converged: YES YES NO NO
title: Mulliken charges:
elementType: O N C C C C C C C C C C H H H H H H H H H H H H H H H
charge: -0.302289 -0.576438 -0.145065 -0.227829 -0.334195 -0.684869 0.380672 -0.380265 -0.411820 -0.227420 -0.217266 -0.242746 0.220118 0.223466 0.167961 0.201377 0.203840 0.208646 0.194173 0.245953 0.257374 0.276805 0.224899 0.272800 0.223382 0.223039 0.225696
chargesum: 0.00000
title: Mulliken charges with hydrogens summed into heavy atoms:
elementType: O N C C C C C C C C C C
charge: -0.302289 -0.042259 0.075053 0.163599 0.071022 -0.036096 0.380672 -0.155366 -0.139020 -0.004038 0.005773 -0.017050
polarizability: 1.56866875e+02 -4.06687420e+00 1.16576228e+02 -3.84931026e+00 -7.89587614e+00 7.22413134e+01
1716.lowfreq: -5.7897 -0.0004 -0.0002 0.0005 7.0845 14.5894 19.6868 39.6721 70.4127
frequency: 18.7963 39.6619 70.3239 81.7575 124.8819 185.3024 203.3261 210.6409 242.5615 252.7747 347.3869 393.1101 402.6229 442.5940 463.6421 499.5001 594.1872 616.8684 634.7917 702.2129 737.6827 798.6871 837.9999 855.5143 906.9505 915.0013 942.5413 955.2649 978.5295 989.5982 994.1824 1013.3617 1023.0228 1026.9773 1063.0201 1085.0936 1117.6293 1164.6086 1170.3039 1173.5649 1182.9034 1205.0970 1214.8634 1244.6019 1301.1567 1320.6421 1333.8041 1358.4044 1375.6475 1384.7609 1401.5576 1439.6105 1457.7015 1465.4885 1479.6461 1481.4507 1486.1169 1595.3498 1618.9507 1640.0306 2897.2841 2910.4750 2936.8302 2969.1604 2991.5595 3019.1604 3065.7619 3089.1626 3108.4764 3124.2017 3138.2938 3157.1388 3175.9570 3445.7813 3574.9140
redmass: 3.0873 3.8469 4.0499 3.0500 2.3826 1.8438 1.5742 3.1578 1.1109 3.9032 3.4342 2.3175 2.8348 2.0688 2.7611 4.4123 4.8879 6.4014 1.4946 2.3172 1.3564 3.9961 2.6434 1.2516 1.3046 1.2846 5.6849 1.5214 1.3746 6.2695 1.3418 1.5686 1.7897 2.0781 3.6599 1.8524 2.5571 1.6229 1.0629 1.5858 1.1203 1.1074 2.3942 1.3920 1.3898 1.3232 1.2590 1.4665 1.3197 2.9526 1.8313 2.1262 1.0590 1.0890 1.0639 1.1479 2.0559 6.2097 6.0718 1.0935 1.0555 1.0616 1.1037 1.0369 1.0948 1.0892 1.0983 1.0993 1.0875 1.0866 1.0931 1.0987 1.0956 1.0453 1.0965
irintensity: 0.1061 0.4827 0.1543 5.6343 4.0483 25.7791 37.3939 8.7144 0.1274 4.8884 2.1707 17.0023 0.0583 1.9483 9.4581 0.9904 3.1205 0.0996 238.0521 27.3087 88.1329 0.8642 1.6241 0.1325 2.2762 4.1479 15.8230 1.2538 0.0574 0.1511 0.1749 6.5818 11.9391 18.4604 152.0865 36.6634 37.7393 17.1156 1.6122 21.9654 0.7825 2.7310 3.2909 1.5575 19.1775 4.8591 12.2037 0.9128 17.9917 5.1998 7.4772 12.9774 8.8339 13.1027 7.3274 12.8702 11.4697 1.6326 8.3407 36.9956 30.6549 92.5621 48.9561 27.9075 31.9872 38.3861 57.5474 34.1822 11.2575 1.2141 35.5393 33.3778 6.8036 1.3443 0.7871
temp: 298.150 k
press: 1.00000 atm
elementType: 8 7 6 6 6 6 6 6 6 6 6 6 1 1 1 1 1 1 1 1 1 1 1 1 1 1 1
symmnumber: 1
zpe: 603327.1 jmol-1
zpe.correction: 0.229795 hartree
zpe.thermalcorrener: 0.242629 hartree
zpe.thermalcorrenthalpy: 0.243573 hartree
zpe.thermalcorrgfe: 0.188902 hartree
zpe.sumelectzpe: -519.088916 hartree
zpe.sumelectthermal: -519.076082 hartree
zpe.sumelectthermalent: -519.075138 hartree
zpe.sumelectthermalfe: -519.129809 hartree
dipole: 1.2831 -0.4490 0.7373
dipole: 1.5465
quadrupole: -60.8044 -67.8110 -76.1592
quadrupole: 3.8176 2.2666 -4.1110
quadrupole: 7.4538 0.4472 -7.9010 3.8176 2.2666 -4.1110
hfenergy: -519.3187112 hartree
pointgroup: C01[X(C10H15N1O1)]
dipole: -0.5233771 -0.2394102 0.197385 debye
polarizability: 156.4166676|-8.4826955|71.5853217|-2.4556842|-1.9602269|117.682427 unknown
InChI: InChI=1S/C10H15NO/c1-9(11)7-12-8-10-5-3-2-4-6-10/h2-6,9H,7-8,11H2,1H3
charge 0 multiplicity 1
27 atoms
O  -1.115322 0.122586 0.190359
N  -4.806642 0.604225 0.199513
C  -3.472337 0.352065 -0.397489
C  -2.457708 0.285129 0.759545
C  -0.080508 0.050337 1.217348
C  -3.398005 -0.90673 -1.295543
C  1.2860 -0.071134 0.562638
C  2.432119 -0.269914 1.373945
C  1.441298 0.020344 -0.840607
C  3.714502 -0.373069 0.792059
C  2.725708 -0.085197 -1.423638
C  3.865991 -0.281136 -0.611909
H  -3.212631 1.240535 -1.004359
H  -2.521832 1.220057 1.354164
H  -2.694372 -0.575355 1.429327
H  -0.265886 -0.824252 1.882885
H  -0.11844 0.963461 1.856119
H  -4.092791 -0.8173 -2.151031
H  -3.678688 -1.809067 -0.716753
H  -2.373794 -1.055232 -1.679938
H  -5.208817 -0.221916 0.65771
H  -5.475287 1.035788 -0.445491
H  2.323707 -0.34512 2.46408
H  0.551798 0.171443 -1.458039
H  4.592172 -0.526542 1.430331
H  2.834659 -0.014381 -2.51212
H  4.860404 -0.362726 -1.065208
